BDBM50160010 CHEMBL3786147::US10093640, Example 305::US10844032, Example 305
SMILES: Cc1n[nH]c(C)c1-c1cccc2c(CCCOc3cc(C)c(Cl)c(C)c3)c([nH]c12)C(=O)NS(=O)(=O)c1ccccc1
InChI Key: InChIKey=OJQWQPQFXYWZBV-UHFFFAOYSA-N
Data: 3 KI  1 IC50
Activity Spreadsheet -- Enzyme Inhibition Constant Data from BindingDB
Found 4 hits for monomerid = 50160010
Trg + Lig
Ki
nM
ΔG°
kcal/mole
IC50
nM
Kd
nM
EC50/IC50
nM
koff
s-1
kon
M-1s-1
pHTemp
°C
Induced myeloid leukemia cell differentiation protein Mcl-1
(Homo sapiens (Human))
BDBM50160010
(CHEMBL3786147 | US10093640, Example 305 | US108440...)
Show SMILES Cc1n[nH]c(C)c1-c1cccc2c(CCCOc3cc(C)c(Cl)c(C)c3)c([nH]c12)C(=O)NS(=O)(=O)c1ccccc1 |(-3.43,3.61,;-2.26,3.99,;-1.77,5.45,;-.23,5.43,;.23,3.96,;1.4,3.56,;-1.02,3.09,;-1.03,1.55,;-2.38,.77,;-2.38,-.77,;-1.03,-1.55,;.3,-.77,;1.76,-1.24,;2.24,-2.7,;3.75,-3.01,;4.24,-4.47,;5.75,-4.78,;6.23,-6.24,;7.74,-6.56,;8.22,-8.02,;9.43,-8.27,;7.2,-9.17,;7.58,-10.34,;5.69,-8.86,;4.87,-9.77,;5.21,-7.39,;2.66,.02,;1.76,1.24,;.3,.77,;4.2,.04,;4.83,-1.02,;4.95,1.38,;6.49,1.4,;7.12,.35,;5.89,.33,;7.24,2.75,;8.78,2.77,;9.54,4.11,;8.75,5.44,;7.21,5.42,;6.46,4.07,)|
Show InChI InChI=1S/C31H31ClN4O4S/c1-18-16-22(17-19(2)28(18)32)40-15-9-14-25-24-12-8-13-26(27-20(3)34-35-21(27)4)29(24)33-30(25)31(37)36-41(38,39)23-10-6-5-7-11-23/h5-8,10-13,16-17,33H,9,14-15H2,1-4H3,(H,34,35)(H,36,37)
NCI pathway
<10n/an/an/an/an/an/an/an/a
Vanderbilt University School of Medicine
Curated by ChEMBL
Assay Description
Displacement of FITC-Bak-BH3 peptide probe from N-terminal His-tagged human Mcl-1 (172 to 327 residues) expressed in Escherichia coli BL21(DE3) after...
J Med Chem 59: 2054-66 (2016)
BindingDB Entry DOI: 10.7270/Q2F191MW
Induced myeloid leukemia cell differentiation protein Mcl-1 (aa 172-327)
(Homo sapiens (Human))
BDBM50160010
(CHEMBL3786147 | US10093640, Example 305 | US108440...)
Show SMILES Cc1n[nH]c(C)c1-c1cccc2c(CCCOc3cc(C)c(Cl)c(C)c3)c([nH]c12)C(=O)NS(=O)(=O)c1ccccc1 |(-3.43,3.61,;-2.26,3.99,;-1.77,5.45,;-.23,5.43,;.23,3.96,;1.4,3.56,;-1.02,3.09,;-1.03,1.55,;-2.38,.77,;-2.38,-.77,;-1.03,-1.55,;.3,-.77,;1.76,-1.24,;2.24,-2.7,;3.75,-3.01,;4.24,-4.47,;5.75,-4.78,;6.23,-6.24,;7.74,-6.56,;8.22,-8.02,;9.43,-8.27,;7.2,-9.17,;7.58,-10.34,;5.69,-8.86,;4.87,-9.77,;5.21,-7.39,;2.66,.02,;1.76,1.24,;.3,.77,;4.2,.04,;4.83,-1.02,;4.95,1.38,;6.49,1.4,;7.12,.35,;5.89,.33,;7.24,2.75,;8.78,2.77,;9.54,4.11,;8.75,5.44,;7.21,5.42,;6.46,4.07,)|
Show InChI InChI=1S/C31H31ClN4O4S/c1-18-16-22(17-19(2)28(18)32)40-15-9-14-25-24-12-8-13-26(27-20(3)34-35-21(27)4)29(24)33-30(25)31(37)36-41(38,39)23-10-6-5-7-11-23/h5-8,10-13,16-17,33H,9,14-15H2,1-4H3,(H,34,35)(H,36,37)
US Patent
<100n/an/an/an/an/an/an/an/a
Vanderbilt University
US Patent
Assay Description
The assay was run using a fluorescein isothiocyanate-labeled BH3 peptide derived from Bak (FITC-AHx-GQVGRQLAIIGDDINR-NH2) that was purchased from Gen...
US Patent US10844032 (2020)
Induced myeloid leukemia cell differentiation protein Mcl-1
(Homo sapiens (Human))
BDBM50160010
(CHEMBL3786147 | US10093640, Example 305 | US108440...)
Show SMILES Cc1n[nH]c(C)c1-c1cccc2c(CCCOc3cc(C)c(Cl)c(C)c3)c([nH]c12)C(=O)NS(=O)(=O)c1ccccc1 |(-3.43,3.61,;-2.26,3.99,;-1.77,5.45,;-.23,5.43,;.23,3.96,;1.4,3.56,;-1.02,3.09,;-1.03,1.55,;-2.38,.77,;-2.38,-.77,;-1.03,-1.55,;.3,-.77,;1.76,-1.24,;2.24,-2.7,;3.75,-3.01,;4.24,-4.47,;5.75,-4.78,;6.23,-6.24,;7.74,-6.56,;8.22,-8.02,;9.43,-8.27,;7.2,-9.17,;7.58,-10.34,;5.69,-8.86,;4.87,-9.77,;5.21,-7.39,;2.66,.02,;1.76,1.24,;.3,.77,;4.2,.04,;4.83,-1.02,;4.95,1.38,;6.49,1.4,;7.12,.35,;5.89,.33,;7.24,2.75,;8.78,2.77,;9.54,4.11,;8.75,5.44,;7.21,5.42,;6.46,4.07,)|
Show InChI InChI=1S/C31H31ClN4O4S/c1-18-16-22(17-19(2)28(18)32)40-15-9-14-25-24-12-8-13-26(27-20(3)34-35-21(27)4)29(24)33-30(25)31(37)36-41(38,39)23-10-6-5-7-11-23/h5-8,10-13,16-17,33H,9,14-15H2,1-4H3,(H,34,35)(H,36,37)
NCI pathway
517n/an/an/an/an/an/an/an/a
Vanderbilt University School of Medicine
Curated by ChEMBL
Assay Description
Displacement of FITC-Bak-BH3 peptide probe from N-terminal His-tagged human Mcl-1 (172 to 327 residues) expressed in Escherichia coli BL21(DE3) after...
J Med Chem 59: 2054-66 (2016)
BindingDB Entry DOI: 10.7270/Q2F191MW
Induced myeloid leukemia cell differentiation protein Mcl-1
(Homo sapiens (Human))
BDBM50160010
(CHEMBL3786147 | US10093640, Example 305 | US108440...)
Show SMILES Cc1n[nH]c(C)c1-c1cccc2c(CCCOc3cc(C)c(Cl)c(C)c3)c([nH]c12)C(=O)NS(=O)(=O)c1ccccc1 |(-3.43,3.61,;-2.26,3.99,;-1.77,5.45,;-.23,5.43,;.23,3.96,;1.4,3.56,;-1.02,3.09,;-1.03,1.55,;-2.38,.77,;-2.38,-.77,;-1.03,-1.55,;.3,-.77,;1.76,-1.24,;2.24,-2.7,;3.75,-3.01,;4.24,-4.47,;5.75,-4.78,;6.23,-6.24,;7.74,-6.56,;8.22,-8.02,;9.43,-8.27,;7.2,-9.17,;7.58,-10.34,;5.69,-8.86,;4.87,-9.77,;5.21,-7.39,;2.66,.02,;1.76,1.24,;.3,.77,;4.2,.04,;4.83,-1.02,;4.95,1.38,;6.49,1.4,;7.12,.35,;5.89,.33,;7.24,2.75,;8.78,2.77,;9.54,4.11,;8.75,5.44,;7.21,5.42,;6.46,4.07,)|
Show InChI InChI=1S/C31H31ClN4O4S/c1-18-16-22(17-19(2)28(18)32)40-15-9-14-25-24-12-8-13-26(27-20(3)34-35-21(27)4)29(24)33-30(25)31(37)36-41(38,39)23-10-6-5-7-11-23/h5-8,10-13,16-17,33H,9,14-15H2,1-4H3,(H,34,35)(H,36,37)
NCI pathway
US Patent
n/an/a<100n/an/an/an/a7.525
Novartis AG
US Patent
Assay Description
Compound affinity was measured using a fluorescence polarization anisotropy competition assay. Anisotropy measurements were carried out in 384-well, ...
US Patent US10093646 (2018)
BindingDB Entry DOI: 10.7270/Q29P33PN