BDBM50160096 5-(4-Chloro-phenyl)-6-(2,4-dichloro-phenyl)-pyridine-2-carboxylic acid phenylamide::CHEMBL181016
SMILES: Clc1ccc(cc1)-c1ccc(nc1-c1ccc(Cl)cc1Cl)C(=O)Nc1ccccc1
InChI Key: InChIKey=FKOFOMROEAHSQD-UHFFFAOYSA-N
Data: 1 IC50
Activity Spreadsheet -- Enzyme Inhibition Constant Data from BindingDB
Found 1 hit for monomerid = 50160096
Trg + Lig
Ki
nM
ΔG°
kcal/mole
IC50
nM
Kd
nM
EC50/IC50
nM
koff
s-1
kon
M-1s-1
pHTemp
°C
Cannabinoid receptor 1
(Homo sapiens (Human))
BDBM50160096
(5-(4-Chloro-phenyl)-6-(2,4-dichloro-phenyl)-pyridi...)
Show SMILES Clc1ccc(cc1)-c1ccc(nc1-c1ccc(Cl)cc1Cl)C(=O)Nc1ccccc1
Show InChI InChI=1S/C24H15Cl3N2O/c25-16-8-6-15(7-9-16)19-12-13-22(24(30)28-18-4-2-1-3-5-18)29-23(19)20-11-10-17(26)14-21(20)27/h1-14H,(H,28,30)
NCI pathway
Reactome pathway
n/an/a 210n/an/an/an/an/an/a
Merck Research Laboratories
Curated by ChEMBL
Assay Description
Inhibitory concentration tested against human Cannabinoid receptor 1 (hCB1)
Bioorg Med Chem Lett 15: 645-51 (2005)
Article DOI: 10.1016/j.bmcl.2004.11.031
BindingDB Entry DOI: 10.7270/Q2X929SW