BDBM50160111 2-Butoxy-5-(4-chloro-phenyl)-6-(2,4-dichloro-phenyl)-N-methyl-nicotinamide::CHEMBL182948
SMILES: CCCCOc1nc(-c2ccc(Cl)cc2Cl)c(cc1C(=O)NC)-c1ccc(Cl)cc1
InChI Key: InChIKey=NNWDXJFZYJCWJY-UHFFFAOYSA-N
Data: 1 IC50
Activity Spreadsheet -- Enzyme Inhibition Constant Data from BindingDB
Found 1 hit for monomerid = 50160111
Trg + Lig
Ki
nM
ΔG°
kcal/mole
IC50
nM
Kd
nM
EC50/IC50
nM
koff
s-1
kon
M-1s-1
pHTemp
°C
Cannabinoid receptor 1
(Homo sapiens (Human))
BDBM50160111
(2-Butoxy-5-(4-chloro-phenyl)-6-(2,4-dichloro-pheny...)
Show SMILES CCCCOc1nc(-c2ccc(Cl)cc2Cl)c(cc1C(=O)NC)-c1ccc(Cl)cc1
Show InChI InChI=1S/C23H21Cl3N2O2/c1-3-4-11-30-23-19(22(29)27-2)13-18(14-5-7-15(24)8-6-14)21(28-23)17-10-9-16(25)12-20(17)26/h5-10,12-13H,3-4,11H2,1-2H3,(H,27,29)
NCI pathway
Reactome pathway
n/an/a 17n/an/an/an/an/an/a
Merck Research Laboratories
Curated by ChEMBL
Assay Description
Inhibitory concentration tested against human Cannabinoid receptor 1 (hCB1)
Bioorg Med Chem Lett 15: 645-51 (2005)
Article DOI: 10.1016/j.bmcl.2004.11.031
BindingDB Entry DOI: 10.7270/Q2X929SW