BDBM50160117 5-(4-Chloro-phenyl)-2-cyclohexylmethoxy-6-(2,4-dichloro-phenyl)-N-methyl-nicotinamide::CHEMBL360723
SMILES: CNC(=O)c1cc(-c2ccc(Cl)cc2)c(nc1OCC1CCCCC1)-c1ccc(Cl)cc1Cl
InChI Key: InChIKey=ZRPASWQEENKWNT-UHFFFAOYSA-N
Data: 1 IC50
Activity Spreadsheet -- Enzyme Inhibition Constant Data from BindingDB
Found 1 hit for monomerid = 50160117
Trg + Lig
Ki
nM
ΔG°
kcal/mole
IC50
nM
Kd
nM
EC50/IC50
nM
koff
s-1
kon
M-1s-1
pHTemp
°C
Cannabinoid receptor 1
(Homo sapiens (Human))
BDBM50160117
(5-(4-Chloro-phenyl)-2-cyclohexylmethoxy-6-(2,4-dic...)
Show SMILES CNC(=O)c1cc(-c2ccc(Cl)cc2)c(nc1OCC1CCCCC1)-c1ccc(Cl)cc1Cl
Show InChI InChI=1S/C26H25Cl3N2O2/c1-30-25(32)22-14-21(17-7-9-18(27)10-8-17)24(20-12-11-19(28)13-23(20)29)31-26(22)33-15-16-5-3-2-4-6-16/h7-14,16H,2-6,15H2,1H3,(H,30,32)
NCI pathway
Reactome pathway
n/an/a 3.40n/an/an/an/an/an/a
Merck Research Laboratories
Curated by ChEMBL
Assay Description
Inhibitory concentration tested against human Cannabinoid receptor 1 (hCB1)
Bioorg Med Chem Lett 15: 645-51 (2005)
Article DOI: 10.1016/j.bmcl.2004.11.031
BindingDB Entry DOI: 10.7270/Q2X929SW