BDBM50160125 5-(4-Chloro-phenyl)-6-(2,4-dichloro-phenyl)-2-(3,4-difluoro-benzyloxy)-N-methyl-nicotinamide::CHEMBL181875
SMILES: CNC(=O)c1cc(-c2ccc(Cl)cc2)c(nc1OCc1ccc(F)c(F)c1)-c1ccc(Cl)cc1Cl
InChI Key: InChIKey=FPBZDYQUXHBXBO-UHFFFAOYSA-N
Data: 1 IC50
Activity Spreadsheet -- Enzyme Inhibition Constant Data from BindingDB
Found 1 hit for monomerid = 50160125
Trg + Lig
Ki
nM
ΔG°
kcal/mole
IC50
nM
Kd
nM
EC50/IC50
nM
koff
s-1
kon
M-1s-1
pHTemp
°C
Cannabinoid receptor 1
(Homo sapiens (Human))
BDBM50160125
(5-(4-Chloro-phenyl)-6-(2,4-dichloro-phenyl)-2-(3,4...)
Show SMILES CNC(=O)c1cc(-c2ccc(Cl)cc2)c(nc1OCc1ccc(F)c(F)c1)-c1ccc(Cl)cc1Cl
Show InChI InChI=1S/C26H17Cl3F2N2O2/c1-32-25(34)20-12-19(15-3-5-16(27)6-4-15)24(18-8-7-17(28)11-21(18)29)33-26(20)35-13-14-2-9-22(30)23(31)10-14/h2-12H,13H2,1H3,(H,32,34)
NCI pathway
Reactome pathway
n/an/a 3.10n/an/an/an/an/an/a
Merck Research Laboratories
Curated by ChEMBL
Assay Description
Inhibitory concentration tested against human Cannabinoid receptor 1 (hCB1)
Bioorg Med Chem Lett 15: 645-51 (2005)
Article DOI: 10.1016/j.bmcl.2004.11.031
BindingDB Entry DOI: 10.7270/Q2X929SW