BDBM50160255 CHEMBL3785189
SMILES: CCCCCCCNC(=O)Oc1ccc2N(C)C(N(C)Cc2c1)c1ccsc1
InChI Key: InChIKey=HKIHOAMUQYITIL-UHFFFAOYSA-N
Data: 1 IC50
Activity Spreadsheet -- Enzyme Inhibition Constant Data from BindingDB
Found 1 hit for monomerid = 50160255
Trg + Lig
Ki
nM
ΔG°
kcal/mole
IC50
nM
Kd
nM
EC50/IC50
nM
koff
s-1
kon
M-1s-1
pHTemp
°C
Butyrylcholinesterase (BuChE)
(Equus caballus (Horse))
BDBM50160255
(CHEMBL3785189)
Show SMILES CCCCCCCNC(=O)Oc1ccc2N(C)C(N(C)Cc2c1)c1ccsc1
Show InChI InChI=1S/C22H31N3O2S/c1-4-5-6-7-8-12-23-22(26)27-19-9-10-20-18(14-19)15-24(2)21(25(20)3)17-11-13-28-16-17/h9-11,13-14,16,21H,4-8,12,15H2,1-3H3,(H,23,26)
n/an/a 22n/an/an/an/an/an/a
Universit£t W£rzburg
Curated by ChEMBL
Assay Description
Inhibition of equine serum butyrylcholinesterase using butyrylcholine iodide as substrate preincubated for 30 mins followed by substrate addition mea...
J Med Chem 59: 2067-82 (2016)
BindingDB Entry DOI: 10.7270/Q25H7J4D