BDBM50160815 CHEMBL182689::Methanesulfonic acid 3-{(R)-2-[(R)-2-(3-allylamino-phenyl)-2-hydroxy-ethylamino]-propyl}-1H-indol-7-yl ester
SMILES: C[C@H](Cc1c[nH]c2c(OS(C)(=O)=O)cccc12)NC[C@H](O)c1cccc(NCC=C)c1
InChI Key: InChIKey=KIBSDAKEXRNNSH-IERDGZPVSA-N
Data: 2 EC50
Activity Spreadsheet -- Enzyme Inhibition Constant Data from BindingDB
Found 2 hits for monomerid = 50160815
Trg + Lig
Ki
nM
ΔG°
kcal/mole
IC50
nM
Kd
nM
EC50/IC50
nM
koff
s-1
kon
M-1s-1
pHTemp
°C
Beta-3 adrenergic receptor
(Homo sapiens (Human))
BDBM50160815
(CHEMBL182689 | Methanesulfonic acid 3-{(R)-2-[(R)-...)
Show SMILES C[C@H](Cc1c[nH]c2c(OS(C)(=O)=O)cccc12)NC[C@H](O)c1cccc(NCC=C)c1
Show InChI InChI=1S/C23H29N3O4S/c1-4-11-24-19-8-5-7-17(13-19)21(27)15-25-16(2)12-18-14-26-23-20(18)9-6-10-22(23)30-31(3,28)29/h4-10,13-14,16,21,24-27H,1,11-12,15H2,2-3H3/t16-,21+/m1/s1
Reactome pathway
n/an/an/an/a 3.20n/an/an/an/a
Dainippon Pharmaceutical Co., Ltd
Curated by ChEMBL
Assay Description
Agonistic activity was assessed by measuring cAMP accumulation in CHO cells expressing human beta-3 adrenergic receptor
Bioorg Med Chem Lett 15: 1061-4 (2005)
Article DOI: 10.1016/j.bmcl.2004.12.033
BindingDB Entry DOI: 10.7270/Q2TD9WVK
Beta-2 adrenergic receptor
(Homo sapiens (Human))
BDBM50160815
(CHEMBL182689 | Methanesulfonic acid 3-{(R)-2-[(R)-...)
Show SMILES C[C@H](Cc1c[nH]c2c(OS(C)(=O)=O)cccc12)NC[C@H](O)c1cccc(NCC=C)c1
Show InChI InChI=1S/C23H29N3O4S/c1-4-11-24-19-8-5-7-17(13-19)21(27)15-25-16(2)12-18-14-26-23-20(18)9-6-10-22(23)30-31(3,28)29/h4-10,13-14,16,21,24-27H,1,11-12,15H2,2-3H3/t16-,21+/m1/s1
Reactome pathway
n/an/an/an/a 2.20n/an/an/an/a
Dainippon Pharmaceutical Co., Ltd
Curated by ChEMBL
Assay Description
Agonistic activity was assessed by measuring cAMP accumulation in CHO cells expressing human beta-2 adrenergic receptor
Bioorg Med Chem Lett 15: 1061-4 (2005)
Article DOI: 10.1016/j.bmcl.2004.12.033
BindingDB Entry DOI: 10.7270/Q2TD9WVK