BDBM50160816 CHEMBL425161::Methanesulfonic acid 3-{(R)-2-[(R)-2-(3-but-2-enylamino-phenyl)-2-hydroxy-ethylamino]-propyl}-1H-indol-7-yl ester
SMILES: C\C=C\CNc1cccc(c1)[C@@H](O)CN[C@H](C)Cc1c[nH]c2c(OS(C)(=O)=O)cccc12
InChI Key: InChIKey=MAHXPPTYZZUPIK-SALYICCVSA-N
Data: 6 EC50
Activity Spreadsheet -- Enzyme Inhibition Constant Data from BindingDB
Found 6 hits for monomerid = 50160816
Trg + Lig
Ki
nM
ΔG°
kcal/mole
IC50
nM
Kd
nM
EC50/IC50
nM
koff
s-1
kon
M-1s-1
pHTemp
°C
Beta-2 adrenergic receptor
(Homo sapiens (Human))
BDBM50160816
(CHEMBL425161 | Methanesulfonic acid 3-{(R)-2-[(R)-...)
Show SMILES C\C=C\CNc1cccc(c1)[C@@H](O)CN[C@H](C)Cc1c[nH]c2c(OS(C)(=O)=O)cccc12
Show InChI InChI=1S/C24H31N3O4S/c1-4-5-12-25-20-9-6-8-18(14-20)22(28)16-26-17(2)13-19-15-27-24-21(19)10-7-11-23(24)31-32(3,29)30/h4-11,14-15,17,22,25-28H,12-13,16H2,1-3H3/b5-4+/t17-,22+/m1/s1
Reactome pathway
n/an/an/an/a 10n/an/an/an/a
Dainippon Pharmaceutical Co., Ltd
Curated by ChEMBL
Assay Description
Agonistic activity was assessed by measuring cAMP accumulation in CHO cells expressing human beta-2 adrenergic receptor
Bioorg Med Chem Lett 15: 1061-4 (2005)
Article DOI: 10.1016/j.bmcl.2004.12.033
BindingDB Entry DOI: 10.7270/Q2TD9WVK
Beta-3 adrenergic receptor
(Homo sapiens (Human))
BDBM50160816
(CHEMBL425161 | Methanesulfonic acid 3-{(R)-2-[(R)-...)
Show SMILES C\C=C\CNc1cccc(c1)[C@@H](O)CN[C@H](C)Cc1c[nH]c2c(OS(C)(=O)=O)cccc12
Show InChI InChI=1S/C24H31N3O4S/c1-4-5-12-25-20-9-6-8-18(14-20)22(28)16-26-17(2)13-19-15-27-24-21(19)10-7-11-23(24)31-32(3,29)30/h4-11,14-15,17,22,25-28H,12-13,16H2,1-3H3/b5-4+/t17-,22+/m1/s1
Reactome pathway
n/an/an/an/a 1.20n/an/an/an/a
Dainippon Pharmaceutical Co., Ltd
Curated by ChEMBL
Assay Description
Agonistic activity was assessed by measuring cAMP accumulation in CHO cells expressing human beta-3 adrenergic receptor
Bioorg Med Chem Lett 15: 1061-4 (2005)
Article DOI: 10.1016/j.bmcl.2004.12.033
BindingDB Entry DOI: 10.7270/Q2TD9WVK
Beta-2 adrenergic receptor
(Homo sapiens (Human))
BDBM50160816
(CHEMBL425161 | Methanesulfonic acid 3-{(R)-2-[(R)-...)
Show SMILES C\C=C\CNc1cccc(c1)[C@@H](O)CN[C@H](C)Cc1c[nH]c2c(OS(C)(=O)=O)cccc12
Show InChI InChI=1S/C24H31N3O4S/c1-4-5-12-25-20-9-6-8-18(14-20)22(28)16-26-17(2)13-19-15-27-24-21(19)10-7-11-23(24)31-32(3,29)30/h4-11,14-15,17,22,25-28H,12-13,16H2,1-3H3/b5-4+/t17-,22+/m1/s1
Reactome pathway
n/an/an/an/a 170n/an/an/an/a
National Institute of Pharmaceutical Education and Research
Curated by ChEMBL
Assay Description
Agonist activity at Homo sapiens (human) beta2 adrenoreceptor
Med Chem Res 19: 1121-1140 (2010)
Article DOI: 10.1007/s00044-009-9257-x
BindingDB Entry DOI: 10.7270/Q2057JTC
Beta-2 adrenergic receptor and beta-3 adrenergic receptor
(Homo sapiens (Human))
BDBM50160816
(CHEMBL425161 | Methanesulfonic acid 3-{(R)-2-[(R)-...)
Show SMILES C\C=C\CNc1cccc(c1)[C@@H](O)CN[C@H](C)Cc1c[nH]c2c(OS(C)(=O)=O)cccc12
Show InChI InChI=1S/C24H31N3O4S/c1-4-5-12-25-20-9-6-8-18(14-20)22(28)16-26-17(2)13-19-15-27-24-21(19)10-7-11-23(24)31-32(3,29)30/h4-11,14-15,17,22,25-28H,12-13,16H2,1-3H3/b5-4+/t17-,22+/m1/s1
Reactome pathway
n/an/an/an/a 1.20n/an/an/an/a
National Institute of Pharmaceutical Education and Research
Curated by ChEMBL
Assay Description
Agonist activity at Homo sapiens (human) beta3 adrenoreceptor
Med Chem Res 19: 1121-1140 (2010)
Article DOI: 10.1007/s00044-009-9257-x
BindingDB Entry DOI: 10.7270/Q2057JTC
Beta-1 adrenergic receptor
(Homo sapiens (Human))
BDBM50160816
(CHEMBL425161 | Methanesulfonic acid 3-{(R)-2-[(R)-...)
Show SMILES C\C=C\CNc1cccc(c1)[C@@H](O)CN[C@H](C)Cc1c[nH]c2c(OS(C)(=O)=O)cccc12
Show InChI InChI=1S/C24H31N3O4S/c1-4-5-12-25-20-9-6-8-18(14-20)22(28)16-26-17(2)13-19-15-27-24-21(19)10-7-11-23(24)31-32(3,29)30/h4-11,14-15,17,22,25-28H,12-13,16H2,1-3H3/b5-4+/t17-,22+/m1/s1
Reactome pathway
n/an/an/an/a 10n/an/an/an/a
National Institute of Pharmaceutical Education and Research
Curated by ChEMBL
Assay Description
Agonist activity at Homo sapiens (human) beta1 adrenoreceptor
Med Chem Res 19: 1121-1140 (2010)
Article DOI: 10.1007/s00044-009-9257-x
BindingDB Entry DOI: 10.7270/Q2057JTC
Beta-1 adrenergic receptor
(Homo sapiens (Human))
BDBM50160816
(CHEMBL425161 | Methanesulfonic acid 3-{(R)-2-[(R)-...)
Show SMILES C\C=C\CNc1cccc(c1)[C@@H](O)CN[C@H](C)Cc1c[nH]c2c(OS(C)(=O)=O)cccc12
Show InChI InChI=1S/C24H31N3O4S/c1-4-5-12-25-20-9-6-8-18(14-20)22(28)16-26-17(2)13-19-15-27-24-21(19)10-7-11-23(24)31-32(3,29)30/h4-11,14-15,17,22,25-28H,12-13,16H2,1-3H3/b5-4+/t17-,22+/m1/s1
Reactome pathway
n/an/an/an/a 170n/an/an/an/a
Dainippon Pharmaceutical Co., Ltd
Curated by ChEMBL
Assay Description
Agonistic activity was assessed by measuring cAMP accumulation in CHO cells expressing human beta-1 adrenergic receptor
Bioorg Med Chem Lett 15: 1061-4 (2005)
Article DOI: 10.1016/j.bmcl.2004.12.033
BindingDB Entry DOI: 10.7270/Q2TD9WVK