null
SMILES: COC(=O)c1cccc(NC(=O)c2cc(ccc2O)-n2cc(CNc3cc(C)[nH]n3)nn2)c1
InChI Key: InChIKey=VIGCHZBAMJIXFT-UHFFFAOYSA-N
Activity Spreadsheet -- Enzyme Inhibition Constant Data from BindingDB
Found 2 hits for monomerid = 50160877
Trg + Lig
Ki
nM
ΔG°
kcal/mole
IC50
nM
Kd
nM
EC50/IC50
nM
koff
s-1
kon
M-1s-1
pHTemp
°C
Aurora kinase A
(Homo sapiens (Human))
BDBM50160877
(CHEMBL3792583)
Show SMILES COC(=O)c1cccc(NC(=O)c2cc(ccc2O)-n2cc(CNc3cc(C)[nH]n3)nn2)c1
Show InChI InChI=1S/C22H21N7O4/c1-13-8-20(27-25-13)23-11-16-12-29(28-26-16)17-6-7-19(30)18(10-17)21(31)24-15-5-3-4-14(9-15)22(32)33-2/h3-10,12,30H,11H2,1-2H3,(H,24,31)(H2,23,25,27)
NCI pathway
Reactome pathway
n/an/a 1.37E+4n/an/an/an/an/an/a
Ewha Womans University
Curated by ChEMBL
Assay Description
Inhibition of human Aurora A using H-LRRASLG as substrate after 2 hrs by HotSpot assay in presence of 33P-ATP and 10 uM ATP
Bioorg Med Chem 24: 2114-24 (2016)
BindingDB Entry DOI: 10.7270/Q2ZW1NST
Aurora kinase B
(Homo sapiens (Human))
BDBM50160877
(CHEMBL3792583)
Show SMILES COC(=O)c1cccc(NC(=O)c2cc(ccc2O)-n2cc(CNc3cc(C)[nH]n3)nn2)c1
Show InChI InChI=1S/C22H21N7O4/c1-13-8-20(27-25-13)23-11-16-12-29(28-26-16)17-6-7-19(30)18(10-17)21(31)24-15-5-3-4-14(9-15)22(32)33-2/h3-10,12,30H,11H2,1-2H3,(H,24,31)(H2,23,25,27)
Reactome pathway
n/an/a 4.95E+4n/an/an/an/an/an/a
Ewha Womans University
Curated by ChEMBL
Assay Description
Inhibition of human Aurora B using H-LRRASLG as substrate after 2 hrs by HotSpot assay in presence of 33P-ATP and 10 uM ATP
Bioorg Med Chem 24: 2114-24 (2016)
BindingDB Entry DOI: 10.7270/Q2ZW1NST