BDBM50160927 (6S,7aS)-6-(4''-Bromo-biphenyl-3-ylmethoxy)-2-(3,5-dichloro-phenyl)-tetrahydro-pyrrolo[1,2-c]imidazole-1,3-dione::CHEMBL183023
SMILES: Oc1c2C[C@@H](Cn2c(=O)n1-c1cc(Cl)cc(Cl)c1)OCc1cccc(c1)-c1ccc(Br)cc1
InChI Key: InChIKey=NBNAALHPZJTEAJ-QFIPXVFZSA-N
Data: 1 IC50
Activity Spreadsheet -- Enzyme Inhibition Constant Data from BindingDB
Found 1 hit for monomerid = 50160927
Trg + Lig
Ki
nM
ΔG°
kcal/mole
IC50
nM
Kd
nM
EC50/IC50
nM
koff
s-1
kon
M-1s-1
pHTemp
°C
Integrin alpha-L/beta-2
(Homo sapiens (Human))
BDBM50160927
((6S,7aS)-6-(4''-Bromo-biphenyl-3-ylmethoxy)-2-(3,5...)
Show SMILES Oc1c2C[C@@H](Cn2c(=O)n1-c1cc(Cl)cc(Cl)c1)OCc1cccc(c1)-c1ccc(Br)cc1
Show InChI InChI=1S/C25H19BrCl2N2O3/c26-18-6-4-16(5-7-18)17-3-1-2-15(8-17)14-33-22-12-23-24(31)30(25(32)29(23)13-22)21-10-19(27)9-20(28)11-21/h1-11,22,31H,12-14H2/t22-/m0/s1
n/an/a 85n/an/an/an/an/an/a
Cerep
Curated by ChEMBL
Assay Description
Inhibitory concentration against leukocyte function-associated antigen-1 in HSB-2 human lymphoblast and H1HeLa cell adhesion assay
Bioorg Med Chem Lett 15: 1161-4 (2005)
Article DOI: 10.1016/j.bmcl.2004.12.007
BindingDB Entry DOI: 10.7270/Q2NP23W2