null
SMILES: Nc1nc(N2CCCCC2)c(Cl)nc1C(=O)Nc1ccccn1
InChI Key: InChIKey=QHWIBXOXEAMLOD-UHFFFAOYSA-N
Activity Spreadsheet -- Enzyme Inhibition Constant Data from BindingDB
Found 1 hit for monomerid = 50161025
Trg + Lig
Ki
nM
ΔG°
kcal/mole
IC50
nM
Kd
nM
EC50/IC50
nM
koff
s-1
kon
M-1s-1
pHTemp
°C
Metabotropic glutamate receptor 5
(Homo sapiens (Human))
BDBM50161025
(3-Amino-6-chloro-5-piperidin-1-yl-pyrazine-2-carbo...)
Show SMILES Nc1nc(N2CCCCC2)c(Cl)nc1C(=O)Nc1ccccn1
Show InChI InChI=1S/C15H17ClN6O/c16-12-14(22-8-4-1-5-9-22)21-13(17)11(20-12)15(23)19-10-6-2-3-7-18-10/h2-3,6-7H,1,4-5,8-9H2,(H2,17,21)(H,18,19,23)
n/an/a 103n/an/an/an/an/an/a
Merck Research Laboratories
Curated by ChEMBL
Assay Description
Inhibitory concentration against human recombinant metabotropic glutamate receptor 5 (mGlu5) in Ltk cells determined using fluorescence detection met...
Bioorg Med Chem Lett 15: 1197-200 (2005)
Article DOI: 10.1016/j.bmcl.2004.11.078
BindingDB Entry DOI: 10.7270/Q28G8K6P