null
SMILES: CN(C)c1ccc(cc1)C(=O)NCCCCCNC(=O)CS
InChI Key: InChIKey=SGOHSANPZHQNKM-UHFFFAOYSA-N
Activity Spreadsheet -- Enzyme Inhibition Constant Data from BindingDB
Found 5 hits for monomerid = 50161469
Trg + Lig
Ki
nM
ΔG°
kcal/mole
IC50
nM
Kd
nM
EC50/IC50
nM
koff
s-1
kon
M-1s-1
pHTemp
°C
Histone deacetylase 1
(Homo sapiens (Human))
BDBM50161469
(4-(dimethylamino)-N-(5-(2-mercaptoacetamido)pentyl...)
Show SMILES CN(C)c1ccc(cc1)C(=O)NCCCCCNC(=O)CS
Show InChI InChI=1S/C16H25N3O2S/c1-19(2)14-8-6-13(7-9-14)16(21)18-11-5-3-4-10-17-15(20)12-22/h6-9,22H,3-5,10-12H2,1-2H3,(H,17,20)(H,18,21)
NCI pathway
Reactome pathway
n/an/a 1.08E+3n/an/an/an/an/an/a
University of Illinois at Chicago
Curated by ChEMBL
Assay Description
Inhibition of His-tagged HDAC1 expressed in Sf9 cells by fluorescence-based assay
J Med Chem 50: 3054-61 (2007)
Article DOI: 10.1021/jm070178x
BindingDB Entry DOI: 10.7270/Q26W99SW
Histone deacetylase 8
(Homo sapiens (Human))
BDBM50161469
(4-(dimethylamino)-N-(5-(2-mercaptoacetamido)pentyl...)
Show SMILES CN(C)c1ccc(cc1)C(=O)NCCCCCNC(=O)CS
Show InChI InChI=1S/C16H25N3O2S/c1-19(2)14-8-6-13(7-9-14)16(21)18-11-5-3-4-10-17-15(20)12-22/h6-9,22H,3-5,10-12H2,1-2H3,(H,17,20)(H,18,21)
NCI pathway
Reactome pathway
n/an/a 1.02E+4n/an/an/an/an/an/a
University of Illinois at Chicago
Curated by ChEMBL
Assay Description
Inhibition of His-tagged HDAC8 expressed in Sf9 cells by fluorescence-based assay
J Med Chem 50: 3054-61 (2007)
Article DOI: 10.1021/jm070178x
BindingDB Entry DOI: 10.7270/Q26W99SW
Histone deacetylase 2
(Homo sapiens (Human))
BDBM50161469
(4-(dimethylamino)-N-(5-(2-mercaptoacetamido)pentyl...)
Show SMILES CN(C)c1ccc(cc1)C(=O)NCCCCCNC(=O)CS
Show InChI InChI=1S/C16H25N3O2S/c1-19(2)14-8-6-13(7-9-14)16(21)18-11-5-3-4-10-17-15(20)12-22/h6-9,22H,3-5,10-12H2,1-2H3,(H,17,20)(H,18,21)
NCI pathway
Reactome pathway
n/an/a 6.46E+3n/an/an/an/an/an/a
University of Illinois at Chicago
Curated by ChEMBL
Assay Description
Inhibition of His-tagged HDAC2 expressed in Sf9 cells by fluorescence-based assay
J Med Chem 50: 3054-61 (2007)
Article DOI: 10.1021/jm070178x
BindingDB Entry DOI: 10.7270/Q26W99SW
Histone deacetylase 6
(Homo sapiens (Human))
BDBM50161469
(4-(dimethylamino)-N-(5-(2-mercaptoacetamido)pentyl...)
Show SMILES CN(C)c1ccc(cc1)C(=O)NCCCCCNC(=O)CS
Show InChI InChI=1S/C16H25N3O2S/c1-19(2)14-8-6-13(7-9-14)16(21)18-11-5-3-4-10-17-15(20)12-22/h6-9,22H,3-5,10-12H2,1-2H3,(H,17,20)(H,18,21)
NCI pathway
Reactome pathway
n/an/a 114n/an/an/an/an/an/a
University of Illinois at Chicago
Curated by ChEMBL
Assay Description
Inhibition of His-tagged HDAC6 expressed in Sf9 cells by fluorescence-based assay
J Med Chem 50: 3054-61 (2007)
Article DOI: 10.1021/jm070178x
BindingDB Entry DOI: 10.7270/Q26W99SW
Polyamine deacetylase HDAC10
(Homo sapiens (Human))
BDBM50161469
(4-(dimethylamino)-N-(5-(2-mercaptoacetamido)pentyl...)
Show SMILES CN(C)c1ccc(cc1)C(=O)NCCCCCNC(=O)CS
Show InChI InChI=1S/C16H25N3O2S/c1-19(2)14-8-6-13(7-9-14)16(21)18-11-5-3-4-10-17-15(20)12-22/h6-9,22H,3-5,10-12H2,1-2H3,(H,17,20)(H,18,21)
NCI pathway
Reactome pathway
n/an/a 1.54E+3n/an/an/an/an/an/a
University of Illinois at Chicago
Curated by ChEMBL
Assay Description
Inhibition of His-tagged HDAC10 expressed in Sf9 cells by fluorescence-based assay
J Med Chem 50: 3054-61 (2007)
Article DOI: 10.1021/jm070178x
BindingDB Entry DOI: 10.7270/Q26W99SW