BDBM50161485 CHEMBL3786719
SMILES: CN(C)S(=O)(=O)NC1CCc2ccc(O)cc2C1
InChI Key: InChIKey=GFRRIQQMMDFSHX-UHFFFAOYSA-N
Data: 3 KI  3 IC50
Activity Spreadsheet -- Enzyme Inhibition Constant Data from BindingDB
Found 6 hits for monomerid = 50161485
Trg + Lig
Ki
nM
ΔG°
kcal/mole
IC50
nM
Kd
nM
EC50/IC50
nM
koff
s-1
kon
M-1s-1
pHTemp
°C
Acetylcholinesterase
(Homo sapiens (Human))
BDBM50161485
(CHEMBL3786719)
Show SMILES CN(C)S(=O)(=O)NC1CCc2ccc(O)cc2C1
Show InChI InChI=1S/C21H24N2O4S/c24-28(25,18-5-2-1-3-6-18)23-13-9-19-20(23)7-4-8-21(19)27-16-12-22-17-10-14-26-15-11-17/h1-9,13,17,22H,10-12,14-16H2
NCI pathway
Reactome pathway
0.720n/an/an/an/an/an/an/an/a
Erzurum Technical University
Curated by ChEMBL
Assay Description
Inhibition of AChE (unknown origin) using acetylcholine iodate as substrate preincubated for 10 mins followed by substrate addition by Lineweaver-Bur...
Bioorg Med Chem 24: 2318-29 (2016)
BindingDB Entry DOI: 10.7270/Q2930W3J
Carbonic anhydrase 2
(Homo sapiens (Human))
BDBM50161485
(CHEMBL3786719)
Show SMILES CN(C)S(=O)(=O)NC1CCc2ccc(O)cc2C1
Show InChI InChI=1S/C21H24N2O4S/c24-28(25,18-5-2-1-3-6-18)23-13-9-19-20(23)7-4-8-21(19)27-16-12-22-17-10-14-26-15-11-17/h1-9,13,17,22H,10-12,14-16H2
Reactome pathway
1.80n/an/an/an/an/an/an/an/a
Erzurum Technical University
Curated by ChEMBL
Assay Description
Inhibition of human carbonic anhydrase 2 using 4-nitrophenylacetate as substrate by Lineweaver-Burk plot analysis
Bioorg Med Chem 24: 2318-29 (2016)
BindingDB Entry DOI: 10.7270/Q2930W3J
Carbonic anhydrase 1
(Homo sapiens (Human))
BDBM50161485
(CHEMBL3786719)
Show SMILES CN(C)S(=O)(=O)NC1CCc2ccc(O)cc2C1
Show InChI InChI=1S/C21H24N2O4S/c24-28(25,18-5-2-1-3-6-18)23-13-9-19-20(23)7-4-8-21(19)27-16-12-22-17-10-14-26-15-11-17/h1-9,13,17,22H,10-12,14-16H2
NCI pathway
Reactome pathway
3n/an/an/an/an/an/an/an/a
Erzurum Technical University
Curated by ChEMBL
Assay Description
Inhibition of human carbonic anhydrase 1 using 4-nitrophenylacetate as substrate by Lineweaver-Burk plot analysis
Bioorg Med Chem 24: 2318-29 (2016)
BindingDB Entry DOI: 10.7270/Q2930W3J
Acetylcholinesterase
(Homo sapiens (Human))
BDBM50161485
(CHEMBL3786719)
Show SMILES CN(C)S(=O)(=O)NC1CCc2ccc(O)cc2C1
Show InChI InChI=1S/C21H24N2O4S/c24-28(25,18-5-2-1-3-6-18)23-13-9-19-20(23)7-4-8-21(19)27-16-12-22-17-10-14-26-15-11-17/h1-9,13,17,22H,10-12,14-16H2
NCI pathway
Reactome pathway
n/an/a 37n/an/an/an/an/an/a
Erzurum Technical University
Curated by ChEMBL
Assay Description
Inhibition of AChE (unknown origin) using acetylcholine iodate as substrate preincubated for 10 mins followed by substrate addition by Ellman's metho...
Bioorg Med Chem 24: 2318-29 (2016)
BindingDB Entry DOI: 10.7270/Q2930W3J
Carbonic anhydrase 1
(Homo sapiens (Human))
BDBM50161485
(CHEMBL3786719)
Show SMILES CN(C)S(=O)(=O)NC1CCc2ccc(O)cc2C1
Show InChI InChI=1S/C21H24N2O4S/c24-28(25,18-5-2-1-3-6-18)23-13-9-19-20(23)7-4-8-21(19)27-16-12-22-17-10-14-26-15-11-17/h1-9,13,17,22H,10-12,14-16H2
NCI pathway
Reactome pathway
n/an/a 29n/an/an/an/an/an/a
Erzurum Technical University
Curated by ChEMBL
Assay Description
Inhibition of human carbonic anhydrase 1 using 4-nitrophenylacetate as substrate by spectrophotometric analysis
Bioorg Med Chem 24: 2318-29 (2016)
BindingDB Entry DOI: 10.7270/Q2930W3J
Carbonic anhydrase 2
(Homo sapiens (Human))
BDBM50161485
(CHEMBL3786719)
Show SMILES CN(C)S(=O)(=O)NC1CCc2ccc(O)cc2C1
Show InChI InChI=1S/C21H24N2O4S/c24-28(25,18-5-2-1-3-6-18)23-13-9-19-20(23)7-4-8-21(19)27-16-12-22-17-10-14-26-15-11-17/h1-9,13,17,22H,10-12,14-16H2
Reactome pathway
n/an/a 11n/an/an/an/an/an/a
Erzurum Technical University
Curated by ChEMBL
Assay Description
Inhibition of human carbonic anhydrase 2 using 4-nitrophenylacetate as substrate by spectrophotometric analysis
Bioorg Med Chem 24: 2318-29 (2016)
BindingDB Entry DOI: 10.7270/Q2930W3J