BDBM50161558 4,5-Bis-(4-chloro-phenyl)-1-methyl-1H-imidazole-2-carboxylic acid morpholin-4-ylamide::CHEMBL179981
SMILES: Cn1c(nc(c1-c1ccc(Cl)cc1)-c1ccc(Cl)cc1)C(=O)NN1CCOCC1
InChI Key: InChIKey=MKEFXWPVEOSDAH-UHFFFAOYSA-N
Data: 1 IC50
Activity Spreadsheet -- Enzyme Inhibition Constant Data from BindingDB
Found 1 hit for monomerid = 50161558
Trg + Lig
Ki
nM
ΔG°
kcal/mole
IC50
nM
Kd
nM
EC50/IC50
nM
koff
s-1
kon
M-1s-1
pHTemp
°C
Cannabinoid receptor 1
(Homo sapiens (Human))
BDBM50161558
(4,5-Bis-(4-chloro-phenyl)-1-methyl-1H-imidazole-2-...)
Show SMILES Cn1c(nc(c1-c1ccc(Cl)cc1)-c1ccc(Cl)cc1)C(=O)NN1CCOCC1
Show InChI InChI=1S/C21H20Cl2N4O2/c1-26-19(15-4-8-17(23)9-5-15)18(14-2-6-16(22)7-3-14)24-20(26)21(28)25-27-10-12-29-13-11-27/h2-9H,10-13H2,1H3,(H,25,28)
NCI pathway
Reactome pathway
n/an/a 3.10E+3n/an/an/an/an/an/a
Merck Research Laboratories
Curated by ChEMBL
Assay Description
Inhibitory concentration against human recombinant cannabinoid receptor type 1 expressed in Chinese Hamster Ovary (CHO) cells
Bioorg Med Chem Lett 15: 1441-6 (2005)
Article DOI: 10.1016/j.bmcl.2004.12.078
BindingDB Entry DOI: 10.7270/Q2F18Z7R