BDBM50161583 4,5-Bis-(2,4-dichloro-phenyl)-oxazole-2-carboxylic acid cyclohexylamide::CHEMBL181254
SMILES: Clc1ccc(-c2nc(oc2-c2ccc(Cl)cc2Cl)C(=O)NC2CCCCC2)c(Cl)c1
InChI Key: InChIKey=UOUDMDWYPIHYDG-UHFFFAOYSA-N
Data: 1 IC50
Activity Spreadsheet -- Enzyme Inhibition Constant Data from BindingDB
Found 1 hit for monomerid = 50161583
Trg + Lig
Ki
nM
ΔG°
kcal/mole
IC50
nM
Kd
nM
EC50/IC50
nM
koff
s-1
kon
M-1s-1
pHTemp
°C
Cannabinoid receptor 1
(Homo sapiens (Human))
BDBM50161583
(4,5-Bis-(2,4-dichloro-phenyl)-oxazole-2-carboxylic...)
Show SMILES Clc1ccc(-c2nc(oc2-c2ccc(Cl)cc2Cl)C(=O)NC2CCCCC2)c(Cl)c1
Show InChI InChI=1S/C22H18Cl4N2O2/c23-12-6-8-15(17(25)10-12)19-20(16-9-7-13(24)11-18(16)26)30-22(28-19)21(29)27-14-4-2-1-3-5-14/h6-11,14H,1-5H2,(H,27,29)
NCI pathway
Reactome pathway
n/an/a 70n/an/an/an/an/an/a
Merck Research Laboratories
Curated by ChEMBL
Assay Description
Inhibitory concentration against human recombinant cannabinoid receptor type 1 expressed in Chinese Hamster Ovary (CHO) cells
Bioorg Med Chem Lett 15: 1441-6 (2005)
Article DOI: 10.1016/j.bmcl.2004.12.078
BindingDB Entry DOI: 10.7270/Q2F18Z7R