BDBM50161690 3-(5-Chloro-thiazol-2-yl)-1-cyclopentylmethyl-1-(3,4-difluoro-phenyl)-urea::CHEMBL178554
SMILES: Fc1ccc(cc1F)N(CC1CCCC1)C(=O)Nc1ncc(Cl)s1
InChI Key: InChIKey=ZVEWMYGYQFMHRC-UHFFFAOYSA-N
Data: 1 EC50
Activity Spreadsheet -- Enzyme Inhibition Constant Data from BindingDB
Found 1 hit for monomerid = 50161690
Trg + Lig
Ki
nM
ΔG°
kcal/mole
IC50
nM
Kd
nM
EC50/IC50
nM
koff
s-1
kon
M-1s-1
pHTemp
°C
Hexokinase type IV
(Rattus norvegicus)
BDBM50161690
(3-(5-Chloro-thiazol-2-yl)-1-cyclopentylmethyl-1-(3...)
Show SMILES Fc1ccc(cc1F)N(CC1CCCC1)C(=O)Nc1ncc(Cl)s1
Show InChI InChI=1S/C16H16ClF2N3OS/c17-14-8-20-15(24-14)21-16(23)22(9-10-3-1-2-4-10)11-5-6-12(18)13(19)7-11/h5-8,10H,1-4,9H2,(H,20,21,23)
Reactome pathway
n/an/an/an/a 2.60E+3n/an/an/an/a
OSI Pharmaceuticals
Curated by ChEMBL
Assay Description
Effective concentration for glucokinase activation with 5 mM glucose
Bioorg Med Chem Lett 15: 1501-4 (2005)
Article DOI: 10.1016/j.bmcl.2004.12.083
BindingDB Entry DOI: 10.7270/Q2HT2NVC