BDBM50161698 CHEMBL178334::[6-Hydroxy-2-(4-hydroxy-phenyl)-benzo[b]thiophen-3-yl]-[4-(4-isopropyl-piperazin-1-yl)-phenyl]-methanone
SMILES: CC(C)N1CCN(CC1)c1ccc(cc1)C(=O)c1c(sc2cc(O)ccc12)-c1ccc(O)cc1
InChI Key: InChIKey=LQEOPHGPHCWOAC-UHFFFAOYSA-N
Data: 4 IC50
Activity Spreadsheet -- Enzyme Inhibition Constant Data from BindingDB
Found 4 hits for monomerid = 50161698
Trg + Lig
Ki
nM
ΔG°
kcal/mole
IC50
nM
Kd
nM
EC50/IC50
nM
koff
s-1
kon
M-1s-1
pHTemp
°C
Estradiol receptor beta (ERβ)
(Homo sapiens (Human))
BDBM50161698
(CHEMBL178334 | [6-Hydroxy-2-(4-hydroxy-phenyl)-ben...)
Show SMILES CC(C)N1CCN(CC1)c1ccc(cc1)C(=O)c1c(sc2cc(O)ccc12)-c1ccc(O)cc1
Show InChI InChI=1S/C28H28N2O3S/c1-18(2)29-13-15-30(16-14-29)21-7-3-19(4-8-21)27(33)26-24-12-11-23(32)17-25(24)34-28(26)20-5-9-22(31)10-6-20/h3-12,17-18,31-32H,13-16H2,1-2H3
n/an/a 33.9n/an/an/an/an/an/a
Chinese Academy of Sciences
Curated by ChEMBL
Assay Description
Inhibition of estrogen receptor beta
Bioorg Med Chem Lett 15: 1505-7 (2005)
Article DOI: 10.1016/j.bmcl.2004.12.074
BindingDB Entry DOI: 10.7270/Q2D21X4C
Estradiol receptor beta (ERβ)
(Homo sapiens (Human))
BDBM50161698
(CHEMBL178334 | [6-Hydroxy-2-(4-hydroxy-phenyl)-ben...)
Show SMILES CC(C)N1CCN(CC1)c1ccc(cc1)C(=O)c1c(sc2cc(O)ccc12)-c1ccc(O)cc1
Show InChI InChI=1S/C28H28N2O3S/c1-18(2)29-13-15-30(16-14-29)21-7-3-19(4-8-21)27(33)26-24-12-11-23(32)17-25(24)34-28(26)20-5-9-22(31)10-6-20/h3-12,17-18,31-32H,13-16H2,1-2H3
n/an/a 33.9n/an/an/an/an/an/a
Torrey Pines Institute for Molecular Studies
Curated by ChEMBL
Assay Description
Displacement of [3H]-17beta-estradiol from ERbeta
Eur J Med Chem 51: 17-34 (2012)
Article DOI: 10.1016/j.ejmech.2012.02.021
BindingDB Entry DOI: 10.7270/Q2ZP474D
Estrogen receptor
(Homo sapiens (Human))
BDBM50161698
(CHEMBL178334 | [6-Hydroxy-2-(4-hydroxy-phenyl)-ben...)
Show SMILES CC(C)N1CCN(CC1)c1ccc(cc1)C(=O)c1c(sc2cc(O)ccc12)-c1ccc(O)cc1
Show InChI InChI=1S/C28H28N2O3S/c1-18(2)29-13-15-30(16-14-29)21-7-3-19(4-8-21)27(33)26-24-12-11-23(32)17-25(24)34-28(26)20-5-9-22(31)10-6-20/h3-12,17-18,31-32H,13-16H2,1-2H3
n/an/a 0.280n/an/an/an/an/an/a
Torrey Pines Institute for Molecular Studies
Curated by ChEMBL
Assay Description
Displacement of [3H]-17beta-estradiol from ERalpha
Eur J Med Chem 51: 17-34 (2012)
Article DOI: 10.1016/j.ejmech.2012.02.021
BindingDB Entry DOI: 10.7270/Q2ZP474D
Estrogen receptor
(Homo sapiens (Human))
BDBM50161698
(CHEMBL178334 | [6-Hydroxy-2-(4-hydroxy-phenyl)-ben...)
Show SMILES CC(C)N1CCN(CC1)c1ccc(cc1)C(=O)c1c(sc2cc(O)ccc12)-c1ccc(O)cc1
Show InChI InChI=1S/C28H28N2O3S/c1-18(2)29-13-15-30(16-14-29)21-7-3-19(4-8-21)27(33)26-24-12-11-23(32)17-25(24)34-28(26)20-5-9-22(31)10-6-20/h3-12,17-18,31-32H,13-16H2,1-2H3
n/an/a 0.280n/an/an/an/an/an/a
Chinese Academy of Sciences
Curated by ChEMBL
Assay Description
Inhibition of estrogen receptor alpha
Bioorg Med Chem Lett 15: 1505-7 (2005)
Article DOI: 10.1016/j.bmcl.2004.12.074
BindingDB Entry DOI: 10.7270/Q2D21X4C