BDBM50161758 2-(5-chloro-2,3-dihydrobenzo[b]furan-7-ylcarboxamido)-(2R)-4-azabicyclo[2.2.2]octane::CHEMBL419496::N-[(3R)-1-azabicyclo[2.2.2]oct-3-yl]-5-chloro-2,3-dihydro-1-benzofuran-7-carboxamide
SMILES: Clc1cc2CCOc2c(c1)C(=O)N[C@H]1CN2CCC1CC2
InChI Key: InChIKey=NYNPDVHTKWVOLU-AWEZNQCLSA-N
Data: 3 KI  1 EC50
Activity Spreadsheet -- Enzyme Inhibition Constant Data from BindingDB
Found 4 hits for monomerid = 50161758
Trg + Lig
Ki
nM
ΔG°
kcal/mole
IC50
nM
Kd
nM
EC50/IC50
nM
koff
s-1
kon
M-1s-1
pHTemp
°C
5-hydroxytryptamine receptor 3A
(Homo sapiens (Human))
BDBM50161758
(2-(5-chloro-2,3-dihydrobenzo[b]furan-7-ylcarboxami...)
Show SMILES Clc1cc2CCOc2c(c1)C(=O)N[C@H]1CN2CCC1CC2 |wD:13.14,(6.37,-10.17,;7.7,-9.41,;9.02,-10.21,;10.37,-9.5,;11.82,-10.05,;12.78,-8.84,;11.91,-7.55,;10.43,-7.97,;9.14,-7.15,;7.77,-7.86,;9.21,-5.61,;7.89,-4.79,;10.56,-4.88,;10.62,-3.34,;12,-2.64,;12.07,-1.08,;10.76,-.26,;9.37,-.98,;9.31,-2.54,;10.14,-1.35,;10.78,-1.99,)|
Show InChI InChI=1S/C16H19ClN2O2/c17-12-7-11-3-6-21-15(11)13(8-12)16(20)18-14-9-19-4-1-10(14)2-5-19/h7-8,10,14H,1-6,9H2,(H,18,20)/t14-/m0/s1
Reactome pathway
1n/an/an/an/an/an/an/an/a
Targacept, Inc
Curated by ChEMBL
Assay Description
Binding affinity to 5HT3 receptor
J Med Chem 54: 7943-61 (2011)
Article DOI: 10.1021/jm2007672
BindingDB Entry DOI: 10.7270/Q29P32QP
Serotonin 3a (5-HT3a)/3b (5-HT3b) receptor
(Rattus norvegicus-RAT)
BDBM50161758
(2-(5-chloro-2,3-dihydrobenzo[b]furan-7-ylcarboxami...)
Show SMILES Clc1cc2CCOc2c(c1)C(=O)N[C@H]1CN2CCC1CC2 |wD:13.14,(6.37,-10.17,;7.7,-9.41,;9.02,-10.21,;10.37,-9.5,;11.82,-10.05,;12.78,-8.84,;11.91,-7.55,;10.43,-7.97,;9.14,-7.15,;7.77,-7.86,;9.21,-5.61,;7.89,-4.79,;10.56,-4.88,;10.62,-3.34,;12,-2.64,;12.07,-1.08,;10.76,-.26,;9.37,-.98,;9.31,-2.54,;10.14,-1.35,;10.78,-1.99,)|
Show InChI InChI=1S/C16H19ClN2O2/c17-12-7-11-3-6-21-15(11)13(8-12)16(20)18-14-9-19-4-1-10(14)2-5-19/h7-8,10,14H,1-6,9H2,(H,18,20)/t14-/m0/s1
1n/an/an/an/an/an/an/an/a
TBA
Curated by ChEMBL
Assay Description
Binding affinity at 5-hydroxytryptamine 4 receptor in rat striatum by [3H]GR-113808 displacement.
Bioorg Med Chem Lett 6: 263-266 (1996)
Article DOI: 10.1016/0960-894X(96)00002-9
BindingDB Entry DOI: 10.7270/Q2MC90JK
HTR4
(RAT)
BDBM50161758
(2-(5-chloro-2,3-dihydrobenzo[b]furan-7-ylcarboxami...)
Show SMILES Clc1cc2CCOc2c(c1)C(=O)N[C@H]1CN2CCC1CC2 |wD:13.14,(6.37,-10.17,;7.7,-9.41,;9.02,-10.21,;10.37,-9.5,;11.82,-10.05,;12.78,-8.84,;11.91,-7.55,;10.43,-7.97,;9.14,-7.15,;7.77,-7.86,;9.21,-5.61,;7.89,-4.79,;10.56,-4.88,;10.62,-3.34,;12,-2.64,;12.07,-1.08,;10.76,-.26,;9.37,-.98,;9.31,-2.54,;10.14,-1.35,;10.78,-1.99,)|
Show InChI InChI=1S/C16H19ClN2O2/c17-12-7-11-3-6-21-15(11)13(8-12)16(20)18-14-9-19-4-1-10(14)2-5-19/h7-8,10,14H,1-6,9H2,(H,18,20)/t14-/m0/s1
280n/an/an/an/an/an/an/an/a
TBA
Curated by ChEMBL
Assay Description
Binding affinity at 5-hydroxytryptamine 4 receptor in rat striatum by [3H]GR-113808 displacement.
Bioorg Med Chem Lett 6: 263-266 (1996)
Article DOI: 10.1016/0960-894X(96)00002-9
BindingDB Entry DOI: 10.7270/Q2MC90JK
Serotonin (5-HT) receptor
(RAT)
BDBM50161758
(2-(5-chloro-2,3-dihydrobenzo[b]furan-7-ylcarboxami...)
Show SMILES Clc1cc2CCOc2c(c1)C(=O)N[C@H]1CN2CCC1CC2 |wD:13.14,(6.37,-10.17,;7.7,-9.41,;9.02,-10.21,;10.37,-9.5,;11.82,-10.05,;12.78,-8.84,;11.91,-7.55,;10.43,-7.97,;9.14,-7.15,;7.77,-7.86,;9.21,-5.61,;7.89,-4.79,;10.56,-4.88,;10.62,-3.34,;12,-2.64,;12.07,-1.08,;10.76,-.26,;9.37,-.98,;9.31,-2.54,;10.14,-1.35,;10.78,-1.99,)|
Show InChI InChI=1S/C16H19ClN2O2/c17-12-7-11-3-6-21-15(11)13(8-12)16(20)18-14-9-19-4-1-10(14)2-5-19/h7-8,10,14H,1-6,9H2,(H,18,20)/t14-/m0/s1
n/an/an/an/a>1.00E+3n/an/an/an/a
TBA
Curated by ChEMBL
Assay Description
In vitro relaxation of carbachol pre-contracted rat oesophageal TMM.
Bioorg Med Chem Lett 6: 263-266 (1996)
Article DOI: 10.1016/0960-894X(96)00002-9
BindingDB Entry DOI: 10.7270/Q2MC90JK