BDBM50161877 4-Dimethylamino-but-2-enoic acid [4-(4-benzyloxy-3-chloro-phenylamino)-3-cyano-7-ethoxy-quinolin-6-yl]-amide::CHEMBL434720
SMILES: CCOc1cc2ncc(C#N)c(Nc3ccc(OCc4ccccc4)c(Cl)c3)c2cc1NC(=O)\C=C\CN(C)C
InChI Key: InChIKey=XOYJBTWSRNRWGI-DHZHZOJOSA-N
Data: 2 IC50
Activity Spreadsheet -- Enzyme Inhibition Constant Data from BindingDB
Found 2 hits for monomerid = 50161877
Trg + Lig
Ki
nM
ΔG°
kcal/mole
IC50
nM
Kd
nM
EC50/IC50
nM
koff
s-1
kon
M-1s-1
pHTemp
°C
Receptor tyrosine-protein kinase erbB-2
(Homo sapiens (Human))
BDBM50161877
(4-Dimethylamino-but-2-enoic acid [4-(4-benzyloxy-3...)
Show SMILES CCOc1cc2ncc(C#N)c(Nc3ccc(OCc4ccccc4)c(Cl)c3)c2cc1NC(=O)\C=C\CN(C)C
Show InChI InChI=1S/C31H30ClN5O3/c1-4-39-29-17-26-24(16-27(29)36-30(38)11-8-14-37(2)3)31(22(18-33)19-34-26)35-23-12-13-28(25(32)15-23)40-20-21-9-6-5-7-10-21/h5-13,15-17,19H,4,14,20H2,1-3H3,(H,34,35)(H,36,38)/b11-8+
n/an/a 76n/an/an/an/an/an/a
Wyeth Research
Curated by ChEMBL
Assay Description
Inhibition of human epidermal growth factor receptor-2 (HER-2) autophosphorylation
J Med Chem 48: 1107-31 (2005)
Article DOI: 10.1021/jm040159c
BindingDB Entry DOI: 10.7270/Q2BP03KG
Epidermal growth factor receptor
(Homo sapiens (Human))
BDBM50161877
(4-Dimethylamino-but-2-enoic acid [4-(4-benzyloxy-3...)
Show SMILES CCOc1cc2ncc(C#N)c(Nc3ccc(OCc4ccccc4)c(Cl)c3)c2cc1NC(=O)\C=C\CN(C)C
Show InChI InChI=1S/C31H30ClN5O3/c1-4-39-29-17-26-24(16-27(29)36-30(38)11-8-14-37(2)3)31(22(18-33)19-34-26)35-23-12-13-28(25(32)15-23)40-20-21-9-6-5-7-10-21/h5-13,15-17,19H,4,14,20H2,1-3H3,(H,34,35)(H,36,38)/b11-8+
n/an/a 53n/an/an/an/an/an/a
Wyeth Research
Curated by ChEMBL
Assay Description
Inhibition of human epidermal growth factor receptor (EGFR) autophosphorylation
J Med Chem 48: 1107-31 (2005)
Article DOI: 10.1021/jm040159c
BindingDB Entry DOI: 10.7270/Q2BP03KG