null
SMILES: COc1cc2ncc(C#N)c(Nc3ccc(Sc4nccn4C)c(Cl)c3)c2cc1NC(=O)\C=C\CN(C)C
InChI Key: InChIKey=BQZMCLZHBMFQQD-AATRIKPKSA-N
Activity Spreadsheet -- Enzyme Inhibition Constant Data from BindingDB
Found 2 hits for monomerid = 50161895
Trg + Lig
Ki
nM
ΔG°
kcal/mole
IC50
nM
Kd
nM
EC50/IC50
nM
koff
s-1
kon
M-1s-1
pHTemp
°C
Epidermal growth factor receptor
(Homo sapiens (Human))
BDBM50161895
(2-{2-Chloro-4-[3-cyano-6-(4-dimethylamino-but-2-en...)
Show SMILES COc1cc2ncc(C#N)c(Nc3ccc(Sc4nccn4C)c(Cl)c3)c2cc1NC(=O)\C=C\CN(C)C
Show InChI InChI=1S/C27H26ClN7O2S/c1-34(2)10-5-6-25(36)33-22-13-19-21(14-23(22)37-4)31-16-17(15-29)26(19)32-18-7-8-24(20(28)12-18)38-27-30-9-11-35(27)3/h5-9,11-14,16H,10H2,1-4H3,(H,31,32)(H,33,36)/b6-5+
n/an/a 41n/an/an/an/an/an/a
Wyeth Research
Curated by ChEMBL
Assay Description
Inhibition of human epidermal growth factor receptor (EGFR) autophosphorylation
J Med Chem 48: 1107-31 (2005)
Article DOI: 10.1021/jm040159c
BindingDB Entry DOI: 10.7270/Q2BP03KG
Receptor tyrosine-protein kinase erbB-2
(Homo sapiens (Human))
BDBM50161895
(2-{2-Chloro-4-[3-cyano-6-(4-dimethylamino-but-2-en...)
Show SMILES COc1cc2ncc(C#N)c(Nc3ccc(Sc4nccn4C)c(Cl)c3)c2cc1NC(=O)\C=C\CN(C)C
Show InChI InChI=1S/C27H26ClN7O2S/c1-34(2)10-5-6-25(36)33-22-13-19-21(14-23(22)37-4)31-16-17(15-29)26(19)32-18-7-8-24(20(28)12-18)38-27-30-9-11-35(27)3/h5-9,11-14,16H,10H2,1-4H3,(H,31,32)(H,33,36)/b6-5+
n/an/a 155n/an/an/an/an/an/a
Wyeth Research
Curated by ChEMBL
Assay Description
Inhibition of human epidermal growth factor receptor-2 (HER-2) autophosphorylation
J Med Chem 48: 1107-31 (2005)
Article DOI: 10.1021/jm040159c
BindingDB Entry DOI: 10.7270/Q2BP03KG