BDBM50161916 4-Dimethylamino-but-2-enoic acid [4-(4-benzylamino-3-chloro-phenylamino)-3-cyano-7-ethoxy-quinolin-6-yl]-amide::CHEMBL179577
SMILES: CCOc1cc2ncc(C#N)c(Nc3ccc(NCc4ccccc4)c(Cl)c3)c2cc1NC(=O)\C=C\CN(C)C
InChI Key: InChIKey=FDLNUHGKXIYPDA-DHZHZOJOSA-N
Data: 2 IC50
Activity Spreadsheet -- Enzyme Inhibition Constant Data from BindingDB
Found 2 hits for monomerid = 50161916
Trg + Lig
Ki
nM
ΔG°
kcal/mole
IC50
nM
Kd
nM
EC50/IC50
nM
koff
s-1
kon
M-1s-1
pHTemp
°C
Receptor tyrosine-protein kinase erbB-2
(Homo sapiens (Human))
BDBM50161916
(4-Dimethylamino-but-2-enoic acid [4-(4-benzylamino...)
Show SMILES CCOc1cc2ncc(C#N)c(Nc3ccc(NCc4ccccc4)c(Cl)c3)c2cc1NC(=O)\C=C\CN(C)C
Show InChI InChI=1S/C31H31ClN6O2/c1-4-40-29-17-27-24(16-28(29)37-30(39)11-8-14-38(2)3)31(22(18-33)20-35-27)36-23-12-13-26(25(32)15-23)34-19-21-9-6-5-7-10-21/h5-13,15-17,20,34H,4,14,19H2,1-3H3,(H,35,36)(H,37,39)/b11-8+
n/an/a 103n/an/an/an/an/an/a
Wyeth Research
Curated by ChEMBL
Assay Description
Inhibition of human epidermal growth factor receptor-2 (HER-2) autophosphorylation
J Med Chem 48: 1107-31 (2005)
Article DOI: 10.1021/jm040159c
BindingDB Entry DOI: 10.7270/Q2BP03KG
Epidermal growth factor receptor
(Homo sapiens (Human))
BDBM50161916
(4-Dimethylamino-but-2-enoic acid [4-(4-benzylamino...)
Show SMILES CCOc1cc2ncc(C#N)c(Nc3ccc(NCc4ccccc4)c(Cl)c3)c2cc1NC(=O)\C=C\CN(C)C
Show InChI InChI=1S/C31H31ClN6O2/c1-4-40-29-17-27-24(16-28(29)37-30(39)11-8-14-38(2)3)31(22(18-33)20-35-27)36-23-12-13-26(25(32)15-23)34-19-21-9-6-5-7-10-21/h5-13,15-17,20,34H,4,14,19H2,1-3H3,(H,35,36)(H,37,39)/b11-8+
n/an/a 45n/an/an/an/an/an/a
Wyeth Research
Curated by ChEMBL
Assay Description
Inhibition of human epidermal growth factor receptor (EGFR) autophosphorylation
J Med Chem 48: 1107-31 (2005)
Article DOI: 10.1021/jm040159c
BindingDB Entry DOI: 10.7270/Q2BP03KG