BDBM50161930 4-Dimethylamino-but-2-enoic acid {4-[3-chloro-4-(thiazol-2-ylsulfanyl)-phenylamino]-3-cyano-7-methoxy-quinolin-6-yl}-amide::CHEMBL179572
SMILES: COc1cc2ncc(C#N)c(Nc3ccc(Sc4nccs4)c(Cl)c3)c2cc1NC(=O)\C=C\CN(C)C
InChI Key: InChIKey=VAEBOYGSUMEZLQ-SNAWJCMRSA-N
Data: 2 IC50
Activity Spreadsheet -- Enzyme Inhibition Constant Data from BindingDB
Found 2 hits for monomerid = 50161930
Trg + Lig
Ki
nM
ΔG°
kcal/mole
IC50
nM
Kd
nM
EC50/IC50
nM
koff
s-1
kon
M-1s-1
pHTemp
°C
Epidermal growth factor receptor
(Homo sapiens (Human))
BDBM50161930
(4-Dimethylamino-but-2-enoic acid {4-[3-chloro-4-(t...)
Show SMILES COc1cc2ncc(C#N)c(Nc3ccc(Sc4nccs4)c(Cl)c3)c2cc1NC(=O)\C=C\CN(C)C
Show InChI InChI=1S/C26H23ClN6O2S2/c1-33(2)9-4-5-24(34)32-21-12-18-20(13-22(21)35-3)30-15-16(14-28)25(18)31-17-6-7-23(19(27)11-17)37-26-29-8-10-36-26/h4-8,10-13,15H,9H2,1-3H3,(H,30,31)(H,32,34)/b5-4+
n/an/a 42n/an/an/an/an/an/a
Wyeth Research
Curated by ChEMBL
Assay Description
Inhibition of human epidermal growth factor receptor (EGFR) autophosphorylation
J Med Chem 48: 1107-31 (2005)
Article DOI: 10.1021/jm040159c
BindingDB Entry DOI: 10.7270/Q2BP03KG
Receptor tyrosine-protein kinase erbB-2
(Homo sapiens (Human))
BDBM50161930
(4-Dimethylamino-but-2-enoic acid {4-[3-chloro-4-(t...)
Show SMILES COc1cc2ncc(C#N)c(Nc3ccc(Sc4nccs4)c(Cl)c3)c2cc1NC(=O)\C=C\CN(C)C
Show InChI InChI=1S/C26H23ClN6O2S2/c1-33(2)9-4-5-24(34)32-21-12-18-20(13-22(21)35-3)30-15-16(14-28)25(18)31-17-6-7-23(19(27)11-17)37-26-29-8-10-36-26/h4-8,10-13,15H,9H2,1-3H3,(H,30,31)(H,32,34)/b5-4+
n/an/a 83n/an/an/an/an/an/a
Wyeth Research
Curated by ChEMBL
Assay Description
Inhibition of human epidermal growth factor receptor-2 (HER-2) autophosphorylation
J Med Chem 48: 1107-31 (2005)
Article DOI: 10.1021/jm040159c
BindingDB Entry DOI: 10.7270/Q2BP03KG