BDBM50161938 4-Piperidin-1-yl-but-2-enoic acid [4-(4-benzyloxy-3-chloro-phenylamino)-3-cyano-7-ethoxy-quinolin-6-yl]-amide::CHEMBL360958
SMILES: CCOc1cc2ncc(C#N)c(Nc3ccc(OCc4ccccc4)c(Cl)c3)c2cc1NC(=O)\C=C\CN1CCCCC1
InChI Key: InChIKey=CFFCHXQRKUPYPT-FMIVXFBMSA-N
Data: 2 IC50
Activity Spreadsheet -- Enzyme Inhibition Constant Data from BindingDB
Found 2 hits for monomerid = 50161938
Trg + Lig
Ki
nM
ΔG°
kcal/mole
IC50
nM
Kd
nM
EC50/IC50
nM
koff
s-1
kon
M-1s-1
pHTemp
°C
Epidermal growth factor receptor
(Homo sapiens (Human))
BDBM50161938
(4-Piperidin-1-yl-but-2-enoic acid [4-(4-benzyloxy-...)
Show SMILES CCOc1cc2ncc(C#N)c(Nc3ccc(OCc4ccccc4)c(Cl)c3)c2cc1NC(=O)\C=C\CN1CCCCC1
Show InChI InChI=1S/C34H34ClN5O3/c1-2-42-32-20-29-27(19-30(32)39-33(41)12-9-17-40-15-7-4-8-16-40)34(25(21-36)22-37-29)38-26-13-14-31(28(35)18-26)43-23-24-10-5-3-6-11-24/h3,5-6,9-14,18-20,22H,2,4,7-8,15-17,23H2,1H3,(H,37,38)(H,39,41)/b12-9+
n/an/a 31n/an/an/an/an/an/a
Wyeth Research
Curated by ChEMBL
Assay Description
Inhibition of human epidermal growth factor receptor (EGFR) autophosphorylation
J Med Chem 48: 1107-31 (2005)
Article DOI: 10.1021/jm040159c
BindingDB Entry DOI: 10.7270/Q2BP03KG
Receptor tyrosine-protein kinase erbB-2
(Homo sapiens (Human))
BDBM50161938
(4-Piperidin-1-yl-but-2-enoic acid [4-(4-benzyloxy-...)
Show SMILES CCOc1cc2ncc(C#N)c(Nc3ccc(OCc4ccccc4)c(Cl)c3)c2cc1NC(=O)\C=C\CN1CCCCC1
Show InChI InChI=1S/C34H34ClN5O3/c1-2-42-32-20-29-27(19-30(32)39-33(41)12-9-17-40-15-7-4-8-16-40)34(25(21-36)22-37-29)38-26-13-14-31(28(35)18-26)43-23-24-10-5-3-6-11-24/h3,5-6,9-14,18-20,22H,2,4,7-8,15-17,23H2,1H3,(H,37,38)(H,39,41)/b12-9+
n/an/a 25n/an/an/an/an/an/a
Wyeth Research
Curated by ChEMBL
Assay Description
Inhibition of human epidermal growth factor receptor-2 (HER-2) autophosphorylation
J Med Chem 48: 1107-31 (2005)
Article DOI: 10.1021/jm040159c
BindingDB Entry DOI: 10.7270/Q2BP03KG