null
SMILES: COc1cc2ncc(C#N)c(Nc3ccc(OCc4ccccc4)c(Cl)c3)c2cc1NC(=O)\C=C\CN(C)C
InChI Key: InChIKey=AILSWWUTQDGMFN-JXMROGBWSA-N
Activity Spreadsheet -- Enzyme Inhibition Constant Data from BindingDB
Found 2 hits for monomerid = 50161940
Trg + Lig
Ki
nM
ΔG°
kcal/mole
IC50
nM
Kd
nM
EC50/IC50
nM
koff
s-1
kon
M-1s-1
pHTemp
°C
Epidermal growth factor receptor
(Homo sapiens (Human))
BDBM50161940
(4-Dimethylamino-but-2-enoic acid [4-(4-benzyloxy-3...)
Show SMILES COc1cc2ncc(C#N)c(Nc3ccc(OCc4ccccc4)c(Cl)c3)c2cc1NC(=O)\C=C\CN(C)C
Show InChI InChI=1S/C30H28ClN5O3/c1-36(2)13-7-10-29(37)35-26-15-23-25(16-28(26)38-3)33-18-21(17-32)30(23)34-22-11-12-27(24(31)14-22)39-19-20-8-5-4-6-9-20/h4-12,14-16,18H,13,19H2,1-3H3,(H,33,34)(H,35,37)/b10-7+
n/an/a 24n/an/an/an/an/an/a
Wyeth Research
Curated by ChEMBL
Assay Description
Inhibition of human epidermal growth factor receptor (EGFR) autophosphorylation
J Med Chem 48: 1107-31 (2005)
Article DOI: 10.1021/jm040159c
BindingDB Entry DOI: 10.7270/Q2BP03KG
Receptor tyrosine-protein kinase erbB-2
(Homo sapiens (Human))
BDBM50161940
(4-Dimethylamino-but-2-enoic acid [4-(4-benzyloxy-3...)
Show SMILES COc1cc2ncc(C#N)c(Nc3ccc(OCc4ccccc4)c(Cl)c3)c2cc1NC(=O)\C=C\CN(C)C
Show InChI InChI=1S/C30H28ClN5O3/c1-36(2)13-7-10-29(37)35-26-15-23-25(16-28(26)38-3)33-18-21(17-32)30(23)34-22-11-12-27(24(31)14-22)39-19-20-8-5-4-6-9-20/h4-12,14-16,18H,13,19H2,1-3H3,(H,33,34)(H,35,37)/b10-7+
n/an/a 39n/an/an/an/an/an/a
Wyeth Research
Curated by ChEMBL
Assay Description
Inhibition of human epidermal growth factor receptor-2 (HER-2) autophosphorylation
J Med Chem 48: 1107-31 (2005)
Article DOI: 10.1021/jm040159c
BindingDB Entry DOI: 10.7270/Q2BP03KG