BDBM50161946 4-Dimethylamino-but-2-enoic acid [4-(1-benzenesulfonyl-1H-indol-5-ylamino)-3-cyano-7-ethoxy-quinolin-6-yl]-amide::CHEMBL179164
SMILES: CCOc1cc2ncc(C#N)c(Nc3ccc4n(ccc4c3)S(=O)(=O)c3ccccc3)c2cc1NC(=O)\C=C\CN(C)C
InChI Key: InChIKey=PCAULTNLFAMHON-DHZHZOJOSA-N
Data: 2 IC50
Activity Spreadsheet -- Enzyme Inhibition Constant Data from BindingDB
Found 2 hits for monomerid = 50161946
Trg + Lig
Ki
nM
ΔG°
kcal/mole
IC50
nM
Kd
nM
EC50/IC50
nM
koff
s-1
kon
M-1s-1
pHTemp
°C
Epidermal growth factor receptor
(Homo sapiens (Human))
BDBM50161946
(4-Dimethylamino-but-2-enoic acid [4-(1-benzenesulf...)
Show SMILES CCOc1cc2ncc(C#N)c(Nc3ccc4n(ccc4c3)S(=O)(=O)c3ccccc3)c2cc1NC(=O)\C=C\CN(C)C
Show InChI InChI=1S/C32H30N6O4S/c1-4-42-30-19-27-26(18-28(30)36-31(39)11-8-15-37(2)3)32(23(20-33)21-34-27)35-24-12-13-29-22(17-24)14-16-38(29)43(40,41)25-9-6-5-7-10-25/h5-14,16-19,21H,4,15H2,1-3H3,(H,34,35)(H,36,39)/b11-8+
n/an/a 82n/an/an/an/an/an/a
Wyeth Research
Curated by ChEMBL
Assay Description
Inhibition of human epidermal growth factor receptor (EGFR) autophosphorylation
J Med Chem 48: 1107-31 (2005)
Article DOI: 10.1021/jm040159c
BindingDB Entry DOI: 10.7270/Q2BP03KG
Receptor tyrosine-protein kinase erbB-2
(Homo sapiens (Human))
BDBM50161946
(4-Dimethylamino-but-2-enoic acid [4-(1-benzenesulf...)
Show SMILES CCOc1cc2ncc(C#N)c(Nc3ccc4n(ccc4c3)S(=O)(=O)c3ccccc3)c2cc1NC(=O)\C=C\CN(C)C
Show InChI InChI=1S/C32H30N6O4S/c1-4-42-30-19-27-26(18-28(30)36-31(39)11-8-15-37(2)3)32(23(20-33)21-34-27)35-24-12-13-29-22(17-24)14-16-38(29)43(40,41)25-9-6-5-7-10-25/h5-14,16-19,21H,4,15H2,1-3H3,(H,34,35)(H,36,39)/b11-8+
n/an/a 25n/an/an/an/an/an/a
Wyeth Research
Curated by ChEMBL
Assay Description
Inhibition of human epidermal growth factor receptor-2 (HER-2) autophosphorylation
J Med Chem 48: 1107-31 (2005)
Article DOI: 10.1021/jm040159c
BindingDB Entry DOI: 10.7270/Q2BP03KG