BDBM50162074 CHEMBL3792684
SMILES: CNC(=O)c1cnc2cc(OC)c(OC)cc2c1Nc1ccccc1
InChI Key: InChIKey=KLTXCAGJAJFJJW-UHFFFAOYSA-N
Data: 1 IC50
Activity Spreadsheet -- Enzyme Inhibition Constant Data from BindingDB
Found 3 hits for monomerid = 50162074
Trg + Lig
Ki
nM
ΔG°
kcal/mole
IC50
nM
Kd
nM
EC50/IC50
nM
koff
s-1
kon
M-1s-1
pHTemp
°C
MutT homolog 1 protein (MTH1)
(Homo sapiens (Human))
BDBM50162074
(CHEMBL3792684)
Show SMILES CNC(=O)c1cnc2cc(OC)c(OC)cc2c1Nc1ccccc1
Show InChI InChI=1S/C19H19N3O3/c1-20-19(23)14-11-21-15-10-17(25-3)16(24-2)9-13(15)18(14)22-12-7-5-4-6-8-12/h4-11H,1-3H3,(H,20,23)(H,21,22)
n/an/a 0.5n/an/an/an/an/an/a
Nerviano Medical Sciences S.r.l.
Curated by ChEMBL
Assay Description
Inhibition of MTH1 (unknown origin) using 8-oxo-dGTP as substrate
J Med Chem 59: 2343-5 (2016)
BindingDB Entry DOI: 10.7270/Q2VX0JDP
Oxidized purine nucleoside triphosphate hydrolase
(Homo sapiens)
BDBM50162074
(CHEMBL3792684)
Show SMILES CNC(=O)c1cnc2cc(OC)c(OC)cc2c1Nc1ccccc1
Show InChI InChI=1S/C19H19N3O3/c1-20-19(23)14-11-21-15-10-17(25-3)16(24-2)9-13(15)18(14)22-12-7-5-4-6-8-12/h4-11H,1-3H3,(H,20,23)(H,21,22)
Reactome pathway
n/an/a 0.5n/an/an/an/an/an/a
TBA
Citation and Details
Oxidized purine nucleoside triphosphate hydrolase
(Homo sapiens)
BDBM50162074
(CHEMBL3792684)
Show SMILES CNC(=O)c1cnc2cc(OC)c(OC)cc2c1Nc1ccccc1
Show InChI InChI=1S/C19H19N3O3/c1-20-19(23)14-11-21-15-10-17(25-3)16(24-2)9-13(15)18(14)22-12-7-5-4-6-8-12/h4-11H,1-3H3,(H,20,23)(H,21,22)
Reactome pathway
n/an/an/a 0.200n/an/an/an/an/a
TBA
Citation and Details