BDBM50162105 3-Cyclohexyl-1-(2-morpholin-4-yl-2-oxo-ethyl)-2-p-tolyl-1H-indole-6-carboxylic acid::CHEMBL179228
SMILES: Cc1ccc(cc1)-c1c(C2CCCCC2)c2ccc(cc2n1CC(=O)N1CCOCC1)C(O)=O
InChI Key: InChIKey=WKFFGELPYSAKDR-UHFFFAOYSA-N
Data: 1 IC50  1 EC50
Activity Spreadsheet -- Enzyme Inhibition Constant Data from BindingDB
Found 2 hits for monomerid = 50162105
Trg + Lig
Ki
nM
ΔG°
kcal/mole
IC50
nM
Kd
nM
EC50/IC50
nM
koff
s-1
kon
M-1s-1
pHTemp
°C
Hepatitis C virus NS5B RNA-dependent RNA polymerase
(Hepatitis C virus)
BDBM50162105
(3-Cyclohexyl-1-(2-morpholin-4-yl-2-oxo-ethyl)-2-p-...)
Show SMILES Cc1ccc(cc1)-c1c(C2CCCCC2)c2ccc(cc2n1CC(=O)N1CCOCC1)C(O)=O
Show InChI InChI=1S/C28H32N2O4/c1-19-7-9-21(10-8-19)27-26(20-5-3-2-4-6-20)23-12-11-22(28(32)33)17-24(23)30(27)18-25(31)29-13-15-34-16-14-29/h7-12,17,20H,2-6,13-16,18H2,1H3,(H,32,33)
n/an/an/an/a 300n/an/an/an/a
IRBM (Merck Research Laboratories Rome)
Curated by ChEMBL
Assay Description
Effective concentration to inhibit the activity of RNA dependent RNA polymerase nonstructural protein 5B in hepatitis C virus; n=1
J Med Chem 48: 1314-7 (2005)
Article DOI: 10.1021/jm049122i
BindingDB Entry DOI: 10.7270/Q2C24VXP
Hepatitis C virus NS5B RNA-dependent RNA polymerase
(Hepatitis C virus)
BDBM50162105
(3-Cyclohexyl-1-(2-morpholin-4-yl-2-oxo-ethyl)-2-p-...)
Show SMILES Cc1ccc(cc1)-c1c(C2CCCCC2)c2ccc(cc2n1CC(=O)N1CCOCC1)C(O)=O
Show InChI InChI=1S/C28H32N2O4/c1-19-7-9-21(10-8-19)27-26(20-5-3-2-4-6-20)23-12-11-22(28(32)33)17-24(23)30(27)18-25(31)29-13-15-34-16-14-29/h7-12,17,20H,2-6,13-16,18H2,1H3,(H,32,33)
n/an/a 11n/an/an/an/an/an/a
IRBM (Merck Research Laboratories Rome)
Curated by ChEMBL
Assay Description
Inhibitory activity against RNA dependent RNA polymerase nonstructural protein 5B in hepatitis C virus; n=1
J Med Chem 48: 1314-7 (2005)
Article DOI: 10.1021/jm049122i
BindingDB Entry DOI: 10.7270/Q2C24VXP