BDBM50162136 CHEMBL3792924
SMILES: Cn1c(cc(OCc2cc(F)c(Oc3ccc(Cl)c(c3)C(F)(F)F)c(F)c2)nc1=O)N1CCS(=O)(=O)CC1
InChI Key: InChIKey=FLCSHCSBIFPQJJ-UHFFFAOYSA-N
Data: 1 IC50  1 Kd
PDB links: 1 PDB ID matches this monomer.
Activity Spreadsheet -- Enzyme Inhibition Constant Data from BindingDB
Found 2 hits for monomerid = 50162136
Trg + Lig
Ki
nM
ΔG°
kcal/mole
IC50
nM
Kd
nM
EC50/IC50
nM
koff
s-1
kon
M-1s-1
pHTemp
°C
LDL-associated phospholipase A2
(Homo sapiens (Human))
BDBM50162136
(CHEMBL3792924)
Show SMILES Cn1c(cc(OCc2cc(F)c(Oc3ccc(Cl)c(c3)C(F)(F)F)c(F)c2)nc1=O)N1CCS(=O)(=O)CC1
Show InChI InChI=1S/C23H19ClF5N3O5S/c1-31-20(32-4-6-38(34,35)7-5-32)11-19(30-22(31)33)36-12-13-8-17(25)21(18(26)9-13)37-14-2-3-16(24)15(10-14)23(27,28)29/h2-3,8-11H,4-7,12H2,1H3
NCI pathway
Reactome pathway
n/an/an/a 1.90n/an/an/an/an/a
ShanghaiTech University
Curated by ChEMBL
Assay Description
Binding affinity to human Lp-PLA2 by ITC assay
J Med Chem 59: 5115-20 (2016)
BindingDB Entry DOI: 10.7270/Q23F4RMQ
3D
3D Structure (crystal)
LDL-associated phospholipase A2
(Homo sapiens (Human))
BDBM50162136
(CHEMBL3792924)
Show SMILES Cn1c(cc(OCc2cc(F)c(Oc3ccc(Cl)c(c3)C(F)(F)F)c(F)c2)nc1=O)N1CCS(=O)(=O)CC1
Show InChI InChI=1S/C23H19ClF5N3O5S/c1-31-20(32-4-6-38(34,35)7-5-32)11-19(30-22(31)33)36-12-13-8-17(25)21(18(26)9-13)37-14-2-3-16(24)15(10-14)23(27,28)29/h2-3,8-11H,4-7,12H2,1H3
NCI pathway
Reactome pathway
n/an/a 1.70n/an/an/an/an/an/a
Chinese Academy of Sciences
Curated by ChEMBL
Assay Description
Inhibition of recombinant human Lp-PLA2 using 2-thio-PAF as substrate measured for 10 mins by plate reader analysis
J Med Chem 59: 2674-87 (2016)
BindingDB Entry DOI: 10.7270/Q2R49SN8
3D
3D Structure (crystal)