BDBM50162287 (Rebeccamycin)1,11-dichloro-12-(3,4-dihydroxy-6-hydroxymethyl-5-methoxytetrahydro-2H-2-pyranyl)-6,7,12,13-tetrahydro-5H-indolo[2,3-a]pyrrolo[3,4-c]carbazole-5,7-dione::1,11-dichloro-12-(3,4-dihydroxy-6-hydroxymethyl-5-methoxytetrahydro-2H-2-pyranyl)-6,7,12,13-tetrahydro-5H-indolo[2,3-a]pyrrolo[3,4-c]carbazole-5,7-dione::1,11-dichloro-12-(3,4-dihydroxy-6-hydroxymethyl-5-methoxytetrahydro-2H-2-pyranyl)-6,7,12,13-tetrahydro-5H-indolo[2,3-a]pyrrolo[3,4-c]carbazole-5,7-dione(rebeccamycin)::1,11-dichloro-12-[3,4-dihydroxy-6-hydroxymethyl-5-methoxy-(2R,3R,4S,5R,6R)-tetrahydro-2H-2-pyranyl]-6,7,12,13-tetrahydro-5H-indolo[2,3-a]pyrrolo[3,4-c]carbazole-5,7-dione::CHEMBL370100::Rebeccamycin
SMILES: CO[C@@H]1[C@@H](CO)O[C@H]([C@H](O)[C@H]1O)n1c2c(Cl)cccc2c2c3C(=O)NC(=O)c3c3c4cccc(Cl)c4[nH]c3c12
InChI Key: InChIKey=QEHOIJJIZXRMAN-QZQSLCQPSA-N
Data: 4 IC50
Activity Spreadsheet -- Enzyme Inhibition Constant Data from BindingDB
Found 4 hits for monomerid = 50162287
Trg + Lig
Ki
nM
ΔG°
kcal/mole
IC50
nM
Kd
nM
EC50/IC50
nM
koff
s-1
kon
M-1s-1
pHTemp
°C
Protein kinase C alpha type
(Homo sapiens (Human))
BDBM50162287
((Rebeccamycin)1,11-dichloro-12-(3,4-dihydroxy-6-hy...)
Show SMILES CO[C@@H]1[C@@H](CO)O[C@H]([C@H](O)[C@H]1O)n1c2c(Cl)cccc2c2c3C(=O)NC(=O)c3c3c4cccc(Cl)c4[nH]c3c12 |r|
Show InChI InChI=1S/C27H21Cl2N3O7/c1-38-24-13(8-33)39-27(23(35)22(24)34)32-20-10(5-3-7-12(20)29)15-17-16(25(36)31-26(17)37)14-9-4-2-6-11(28)18(9)30-19(14)21(15)32/h2-7,13,22-24,27,30,33-35H,8H2,1H3,(H,31,36,37)/t13-,22-,23-,24-,27-/m1/s1
NCI pathway
Reactome pathway
n/an/a>1.00E+5n/an/an/an/an/an/a
Université Blaise Pascal
Curated by ChEMBL
Assay Description
Inhibition of Protein kinase C alpha
J Med Chem 40: 3456-65 (1997)
Article DOI: 10.1021/jm9702084
BindingDB Entry DOI: 10.7270/Q2T72GJ6
Protein kinase C (PKC)
(Homo sapiens (Human))
BDBM50162287
((Rebeccamycin)1,11-dichloro-12-(3,4-dihydroxy-6-hy...)
Show SMILES CO[C@@H]1[C@@H](CO)O[C@H]([C@H](O)[C@H]1O)n1c2c(Cl)cccc2c2c3C(=O)NC(=O)c3c3c4cccc(Cl)c4[nH]c3c12 |r|
Show InChI InChI=1S/C27H21Cl2N3O7/c1-38-24-13(8-33)39-27(23(35)22(24)34)32-20-10(5-3-7-12(20)29)15-17-16(25(36)31-26(17)37)14-9-4-2-6-11(28)18(9)30-19(14)21(15)32/h2-7,13,22-24,27,30,33-35H,8H2,1H3,(H,31,36,37)/t13-,22-,23-,24-,27-/m1/s1
n/an/a>1.75E+5n/an/an/an/an/an/a
Universit£ Blaise Pascal
Curated by ChEMBL
Assay Description
Inhibition of protein kinase C (PKC)
J Med Chem 42: 584-92 (1999)
Article DOI: 10.1021/jm980396d
BindingDB Entry DOI: 10.7270/Q2SF2ZXP
Protein kinase C (PKC)
(Homo sapiens (Human))
BDBM50162287
((Rebeccamycin)1,11-dichloro-12-(3,4-dihydroxy-6-hy...)
Show SMILES CO[C@@H]1[C@@H](CO)O[C@H]([C@H](O)[C@H]1O)n1c2c(Cl)cccc2c2c3C(=O)NC(=O)c3c3c4cccc(Cl)c4[nH]c3c12 |r|
Show InChI InChI=1S/C27H21Cl2N3O7/c1-38-24-13(8-33)39-27(23(35)22(24)34)32-20-10(5-3-7-12(20)29)15-17-16(25(36)31-26(17)37)14-9-4-2-6-11(28)18(9)30-19(14)21(15)32/h2-7,13,22-24,27,30,33-35H,8H2,1H3,(H,31,36,37)/t13-,22-,23-,24-,27-/m1/s1
n/an/a>1.00E+5n/an/an/an/an/an/a
TBA
Assay Description
Inhibition of protein kinase C
Citation and Details
BindingDB Entry DOI: 10.7270/Q2HX1FVJ
Protein kinase C alpha type
(Homo sapiens (Human))
BDBM50162287
((Rebeccamycin)1,11-dichloro-12-(3,4-dihydroxy-6-hy...)
Show SMILES CO[C@@H]1[C@@H](CO)O[C@H]([C@H](O)[C@H]1O)n1c2c(Cl)cccc2c2c3C(=O)NC(=O)c3c3c4cccc(Cl)c4[nH]c3c12 |r|
Show InChI InChI=1S/C27H21Cl2N3O7/c1-38-24-13(8-33)39-27(23(35)22(24)34)32-20-10(5-3-7-12(20)29)15-17-16(25(36)31-26(17)37)14-9-4-2-6-11(28)18(9)30-19(14)21(15)32/h2-7,13,22-24,27,30,33-35H,8H2,1H3,(H,31,36,37)/t13-,22-,23-,24-,27-/m1/s1
NCI pathway
Reactome pathway
n/an/a>1.00E+5n/an/an/an/an/an/a
Université Blaise Pascal
Curated by ChEMBL
Assay Description
Inhibition of Protein Kinase C(PKC)
J Med Chem 39: 4471-7 (1996)
Article DOI: 10.1021/jm9603779
BindingDB Entry DOI: 10.7270/Q2S181MM