BDBM50162543 2-(3-Fluoro-phenyl)-3-phenethyl-3H-quinazolin-4-one::CHEMBL368055
SMILES: Fc1cccc(c1)-c1nc2ccccc2c(=O)n1CCc1ccccc1
InChI Key: InChIKey=IFUZDFZNLLYIGL-UHFFFAOYSA-N
Data: 1 IC50
Activity Spreadsheet -- Enzyme Inhibition Constant Data from BindingDB
Found 1 hit for monomerid = 50162543
Trg + Lig
Ki
nM
ΔG°
kcal/mole
IC50
nM
Kd
nM
EC50/IC50
nM
koff
s-1
kon
M-1s-1
pHTemp
°C
Calcium-sensing receptor (CaSR)
(Homo sapiens (Human))
BDBM50162543
(2-(3-Fluoro-phenyl)-3-phenethyl-3H-quinazolin-4-on...)
Show SMILES Fc1cccc(c1)-c1nc2ccccc2c(=O)n1CCc1ccccc1
Show InChI InChI=1S/C22H17FN2O/c23-18-10-6-9-17(15-18)21-24-20-12-5-4-11-19(20)22(26)25(21)14-13-16-7-2-1-3-8-16/h1-12,15H,13-14H2
n/an/a>3.00E+4n/an/an/an/an/an/a
NPS Pharmaceuticals, Inc.
Curated by ChEMBL
Assay Description
Inhibitory concentration against human calcium receptor expressed in HEK 293 cells
Bioorg Med Chem Lett 15: 1557-60 (2005)
Article DOI: 10.1016/j.bmcl.2005.01.078
BindingDB Entry DOI: 10.7270/Q22N51SD