BDBM50162548 2-(4-Methoxy-phenyl)-3-phenethyl-3H-quinazolin-4-one::CHEMBL178528
SMILES: COc1ccc(cc1)-c1nc2ccccc2c(=O)n1CCc1ccccc1
InChI Key: InChIKey=PFVZUFYWEWQFKU-UHFFFAOYSA-N
Data: 1 IC50
Activity Spreadsheet -- Enzyme Inhibition Constant Data from BindingDB
Found 1 hit for monomerid = 50162548
Trg + Lig
Ki
nM
ΔG°
kcal/mole
IC50
nM
Kd
nM
EC50/IC50
nM
koff
s-1
kon
M-1s-1
pHTemp
°C
Calcium-sensing receptor (CaSR)
(Homo sapiens (Human))
BDBM50162548
(2-(4-Methoxy-phenyl)-3-phenethyl-3H-quinazolin-4-o...)
Show SMILES COc1ccc(cc1)-c1nc2ccccc2c(=O)n1CCc1ccccc1
Show InChI InChI=1S/C23H20N2O2/c1-27-19-13-11-18(12-14-19)22-24-21-10-6-5-9-20(21)23(26)25(22)16-15-17-7-3-2-4-8-17/h2-14H,15-16H2,1H3
n/an/a>3.00E+4n/an/an/an/an/an/a
NPS Pharmaceuticals, Inc.
Curated by ChEMBL
Assay Description
Inhibitory concentration against human calcium receptor expressed in HEK 293 cells
Bioorg Med Chem Lett 15: 1557-60 (2005)
Article DOI: 10.1016/j.bmcl.2005.01.078
BindingDB Entry DOI: 10.7270/Q22N51SD