BDBM50162755 (S)-3-(6-Methoxy-pyridin-3-yl)-7-oxo-9-(5,6,7,8-tetrahydro-[1,8]naphthyridin-2-yl)-nonanoic acid::CHEMBL181366
SMILES: COc1ccc(cn1)[C@@H](CCCC(=O)CCc1ccc2CCCNc2n1)CC(O)=O
InChI Key: InChIKey=YJTFZPUDXPSWOJ-KRWDZBQOSA-N
Data: 2 IC50
Activity Spreadsheet -- Enzyme Inhibition Constant Data from BindingDB
Found 2 hits for monomerid = 50162755
Trg + Lig
Ki
nM
ΔG°
kcal/mole
IC50
nM
Kd
nM
EC50/IC50
nM
koff
s-1
kon
M-1s-1
pHTemp
°C
Integrin alpha-IIb/beta-3
(Homo sapiens (Human))
BDBM50162755
((S)-3-(6-Methoxy-pyridin-3-yl)-7-oxo-9-(5,6,7,8-te...)
Show SMILES COc1ccc(cn1)[C@@H](CCCC(=O)CCc1ccc2CCCNc2n1)CC(O)=O
Show InChI InChI=1S/C23H29N3O4/c1-30-21-12-8-18(15-25-21)17(14-22(28)29)4-2-6-20(27)11-10-19-9-7-16-5-3-13-24-23(16)26-19/h7-9,12,15,17H,2-6,10-11,13-14H2,1H3,(H,24,26)(H,28,29)/t17-/m0/s1
n/an/a>1.00E+4n/an/an/an/an/an/a
Merck Research Laboratories
Curated by ChEMBL
Assay Description
Inhibition of alphaIIb-beta3 integrin mediated platelet aggregation (PLAGGIN15)
Bioorg Med Chem Lett 15: 1647-50 (2005)
Article DOI: 10.1016/j.bmcl.2005.01.051
BindingDB Entry DOI: 10.7270/Q25D8RBX
ITGAV/ITGB3
(Homo sapiens (Human))
BDBM50162755
((S)-3-(6-Methoxy-pyridin-3-yl)-7-oxo-9-(5,6,7,8-te...)
Show SMILES COc1ccc(cn1)[C@@H](CCCC(=O)CCc1ccc2CCCNc2n1)CC(O)=O
Show InChI InChI=1S/C23H29N3O4/c1-30-21-12-8-18(15-25-21)17(14-22(28)29)4-2-6-20(27)11-10-19-9-7-16-5-3-13-24-23(16)26-19/h7-9,12,15,17H,2-6,10-11,13-14H2,1H3,(H,24,26)(H,28,29)/t17-/m0/s1
n/an/a 0.160n/an/an/an/an/an/a
Merck Research Laboratories
Curated by ChEMBL
Assay Description
Inhibition of 2(S)-(4-125-iodo-benzenesulfonylamino)-3-4-[2-(5,6,7,8-tetrahydro- [1,8]naphthyridin-2-yl)-ethyl]-benzoylamino-propionic acid binding t...
Bioorg Med Chem Lett 15: 1647-50 (2005)
Article DOI: 10.1016/j.bmcl.2005.01.051
BindingDB Entry DOI: 10.7270/Q25D8RBX