BDBM50162803 (2R,3R,4S)-3-(4-HYDROXYPHENYL)-4-METHYL-2-[4-(2-PYRROLIDIN-1-YLETHOXY)PHENYL]CHROMAN-6-OL::(2R,3R,4S)-3-(4-hydroxyphenyl)-4-methyl-2-[4-(2-pyrrolidin-1-ylethoxy)phenyl]-3,4-dihydro-2H-chromen-6-ol::(2R,3R,4S)-3-(4-hydroxyphenyl)-4-methyl-2-{4-[2-(pyrrolidin-1-yl)ethoxy]phenyl}chroman-6-ol::CHEMBL181936
SMILES: C[C@H]1[C@@H]([C@@H](Oc2ccc(O)cc12)c1ccc(OCCN2CCCC2)cc1)c1ccc(O)cc1
InChI Key: InChIKey=XPVKGTWRXBSJKO-LHXLBICKSA-N
Data: 2 IC50
PDB links: 1 PDB ID matches this monomer.
Activity Spreadsheet -- Enzyme Inhibition Constant Data from BindingDB
Found 2 hits for monomerid = 50162803
Trg + Lig
Ki
nM
ΔG°
kcal/mole
IC50
nM
Kd
nM
EC50/IC50
nM
koff
s-1
kon
M-1s-1
pHTemp
°C
Estrogen receptor
(Homo sapiens (Human))
BDBM50162803
((2R,3R,4S)-3-(4-HYDROXYPHENYL)-4-METHYL-2-[4-(2-PY...)
Show SMILES C[C@H]1[C@@H]([C@@H](Oc2ccc(O)cc12)c1ccc(OCCN2CCCC2)cc1)c1ccc(O)cc1
Show InChI InChI=1S/C28H31NO4/c1-19-25-18-23(31)10-13-26(25)33-28(27(19)20-4-8-22(30)9-5-20)21-6-11-24(12-7-21)32-17-16-29-14-2-3-15-29/h4-13,18-19,27-28,30-31H,2-3,14-17H2,1H3/t19-,27-,28+/m1/s1
n/an/a 1.5n/an/an/an/an/an/a
Merck Research Laboratories
Curated by ChEMBL
Assay Description
Inhibition of estrogen receptor alpha
Bioorg Med Chem Lett 15: 1675-81 (2005)
Article DOI: 10.1016/j.bmcl.2005.01.046
BindingDB Entry DOI: 10.7270/Q2S46RFB
3D
3D Structure (crystal)
Estradiol receptor beta (ERβ)
(Homo sapiens (Human))
BDBM50162803
((2R,3R,4S)-3-(4-HYDROXYPHENYL)-4-METHYL-2-[4-(2-PY...)
Show SMILES C[C@H]1[C@@H]([C@@H](Oc2ccc(O)cc12)c1ccc(OCCN2CCCC2)cc1)c1ccc(O)cc1
Show InChI InChI=1S/C28H31NO4/c1-19-25-18-23(31)10-13-26(25)33-28(27(19)20-4-8-22(30)9-5-20)21-6-11-24(12-7-21)32-17-16-29-14-2-3-15-29/h4-13,18-19,27-28,30-31H,2-3,14-17H2,1H3/t19-,27-,28+/m1/s1
n/an/a 12n/an/an/an/an/an/a
Merck Research Laboratories
Curated by ChEMBL
Assay Description
Inhibition of estrogen receptor beta
Bioorg Med Chem Lett 15: 1675-81 (2005)
Article DOI: 10.1016/j.bmcl.2005.01.046
BindingDB Entry DOI: 10.7270/Q2S46RFB