BDBM50162806 (2R,3R,4S)-3-(4-Hydroxy-phenyl)-4-methyl-2-{4-[(S)-2-((R)-3-methyl-pyrrolidin-1-yl)-propoxy]-phenyl}-chroman-6-ol::CHEMBL368449
SMILES: C[C@@H](COc1ccc(cc1)[C@@H]1Oc2ccc(O)cc2[C@@H](C)[C@@H]1c1ccc(O)cc1)N1CC[C@@H](C)C1
InChI Key: InChIKey=AUBNMBTYWOGQSO-DEEMMSLNSA-N
Data: 2 IC50
Activity Spreadsheet -- Enzyme Inhibition Constant Data from BindingDB
Found 2 hits for monomerid = 50162806
Trg + Lig
Ki
nM
ΔG°
kcal/mole
IC50
nM
Kd
nM
EC50/IC50
nM
koff
s-1
kon
M-1s-1
pHTemp
°C
Estradiol receptor beta (ERβ)
(Homo sapiens (Human))
BDBM50162806
((2R,3R,4S)-3-(4-Hydroxy-phenyl)-4-methyl-2-{4-[(S)...)
Show SMILES C[C@@H](COc1ccc(cc1)[C@@H]1Oc2ccc(O)cc2[C@@H](C)[C@@H]1c1ccc(O)cc1)N1CC[C@@H](C)C1
Show InChI InChI=1S/C30H35NO4/c1-19-14-15-31(17-19)20(2)18-34-26-11-6-23(7-12-26)30-29(22-4-8-24(32)9-5-22)21(3)27-16-25(33)10-13-28(27)35-30/h4-13,16,19-21,29-30,32-33H,14-15,17-18H2,1-3H3/t19-,20+,21-,29-,30+/m1/s1
n/an/a 21n/an/an/an/an/an/a
Merck Research Laboratories
Curated by ChEMBL
Assay Description
Inhibition of estrogen receptor beta
Bioorg Med Chem Lett 15: 1675-81 (2005)
Article DOI: 10.1016/j.bmcl.2005.01.046
BindingDB Entry DOI: 10.7270/Q2S46RFB
Estrogen receptor
(Homo sapiens (Human))
BDBM50162806
((2R,3R,4S)-3-(4-Hydroxy-phenyl)-4-methyl-2-{4-[(S)...)
Show SMILES C[C@@H](COc1ccc(cc1)[C@@H]1Oc2ccc(O)cc2[C@@H](C)[C@@H]1c1ccc(O)cc1)N1CC[C@@H](C)C1
Show InChI InChI=1S/C30H35NO4/c1-19-14-15-31(17-19)20(2)18-34-26-11-6-23(7-12-26)30-29(22-4-8-24(32)9-5-22)21(3)27-16-25(33)10-13-28(27)35-30/h4-13,16,19-21,29-30,32-33H,14-15,17-18H2,1-3H3/t19-,20+,21-,29-,30+/m1/s1
n/an/a 1.30n/an/an/an/an/an/a
Merck Research Laboratories
Curated by ChEMBL
Assay Description
Inhibition of estrogen receptor alpha
Bioorg Med Chem Lett 15: 1675-81 (2005)
Article DOI: 10.1016/j.bmcl.2005.01.046
BindingDB Entry DOI: 10.7270/Q2S46RFB