BDBM50163260 2-[4-(4-Methoxy-phenoxy)-phenyl]-1H-benzoimidazole-5-carboxylic acid amide::CHEMBL176164
SMILES: COc1ccc(Oc2ccc(cc2)-c2nc3ccc(cc3[nH]2)C(N)=O)cc1
InChI Key: InChIKey=RYAFWCGRSKQYBC-UHFFFAOYSA-N
Data: 1 IC50
Activity Spreadsheet -- Enzyme Inhibition Constant Data from BindingDB
Found 1 hit for monomerid = 50163260
Trg + Lig
Ki
nM
ΔG°
kcal/mole
IC50
nM
Kd
nM
EC50/IC50
nM
koff
s-1
kon
M-1s-1
pHTemp
°C
Serine/threonine-protein kinase CHK2
(Homo sapiens (Human))
BDBM50163260
(2-[4-(4-Methoxy-phenoxy)-phenyl]-1H-benzoimidazole...)
Show SMILES COc1ccc(Oc2ccc(cc2)-c2nc3ccc(cc3[nH]2)C(N)=O)cc1
Show InChI InChI=1S/C21H17N3O3/c1-26-15-7-9-17(10-8-15)27-16-5-2-13(3-6-16)21-23-18-11-4-14(20(22)25)12-19(18)24-21/h2-12H,1H3,(H2,22,25)(H,23,24)
n/an/a 23n/an/an/an/an/an/a
Johnson & Johnson Pharmaceutical Research and Development
Curated by ChEMBL
Assay Description
Inhibition of recombinant human Chk2 kinase
J Med Chem 48: 1873-85 (2005)
Article DOI: 10.1021/jm0495935
BindingDB Entry DOI: 10.7270/Q2FQ9W4V