BDBM50163265 2-(4-Phenoxy-phenyl)-1H-benzoimidazole-5-carbonitrile::CHEMBL176554
SMILES: N#Cc1ccc2nc([nH]c2c1)-c1ccc(Oc2ccccc2)cc1
InChI Key: InChIKey=DJHDCPGWYHIZLY-UHFFFAOYSA-N
Data: 1 IC50
Activity Spreadsheet -- Enzyme Inhibition Constant Data from BindingDB
Found 1 hit for monomerid = 50163265
Trg + Lig
Ki
nM
ΔG°
kcal/mole
IC50
nM
Kd
nM
EC50/IC50
nM
koff
s-1
kon
M-1s-1
pHTemp
°C
Serine/threonine-protein kinase CHK2
(Homo sapiens (Human))
BDBM50163265
(2-(4-Phenoxy-phenyl)-1H-benzoimidazole-5-carbonitr...)
Show SMILES N#Cc1ccc2nc([nH]c2c1)-c1ccc(Oc2ccccc2)cc1
Show InChI InChI=1S/C20H13N3O/c21-13-14-6-11-18-19(12-14)23-20(22-18)15-7-9-17(10-8-15)24-16-4-2-1-3-5-16/h1-12H,(H,22,23)
n/an/a 1.90E+3n/an/an/an/an/an/a
Johnson & Johnson Pharmaceutical Research and Development
Curated by ChEMBL
Assay Description
Inhibition of recombinant human Chk2 kinase
J Med Chem 48: 1873-85 (2005)
Article DOI: 10.1021/jm0495935
BindingDB Entry DOI: 10.7270/Q2FQ9W4V