BDBM50163361 CHEMBL3794233
SMILES: Cc1c2COC(=O)c2ccc1C(O)CN1CCN(CC1)C(=O)Cc1ccc(nc1)-n1cnnn1
InChI Key: InChIKey=OTADWVZGHJXVRK-UHFFFAOYSA-N
Data: 2 IC50
Activity Spreadsheet -- Enzyme Inhibition Constant Data from BindingDB
Found 2 hits for monomerid = 50163361
Trg + Lig
Ki
nM
ΔG°
kcal/mole
IC50
nM
Kd
nM
EC50/IC50
nM
koff
s-1
kon
M-1s-1
pHTemp
°C
1,3-beta-glucan synthase component GLS2
(Saccharomyces cerevisiae)
BDBM50163361
(CHEMBL3794233)
Show SMILES Cc1c2COC(=O)c2ccc1C(O)CN1CCN(CC1)C(=O)Cc1ccc(nc1)-n1cnnn1
Show InChI InChI=1S/C23H25N7O4/c1-15-17(3-4-18-19(15)13-34-23(18)33)20(31)12-28-6-8-29(9-7-28)22(32)10-16-2-5-21(24-11-16)30-14-25-26-27-30/h2-5,11,14,20,31H,6-10,12-13H2,1H3
n/an/a 3.30E+4n/an/an/an/an/an/a
Merck Research Laboratories
Curated by ChEMBL
Assay Description
Displacement of [35S]-MK499 from human ERG expressed in HEK293 cells
Bioorg Med Chem Lett 26: 2339-43 (2016)
BindingDB Entry DOI: 10.7270/Q2668G3Q
Renal Outer Medullary Potassium (ROMK)
(Rattus norvegicus (Rat))
BDBM50163361
(CHEMBL3794233)
Show SMILES Cc1c2COC(=O)c2ccc1C(O)CN1CCN(CC1)C(=O)Cc1ccc(nc1)-n1cnnn1
Show InChI InChI=1S/C23H25N7O4/c1-15-17(3-4-18-19(15)13-34-23(18)33)20(31)12-28-6-8-29(9-7-28)22(32)10-16-2-5-21(24-11-16)30-14-25-26-27-30/h2-5,11,14,20,31H,6-10,12-13H2,1H3
n/an/a 1.10E+3n/an/an/an/an/an/a
Merck Research Laboratories
Curated by ChEMBL
Assay Description
Inhibition of rat ROMK expressed in HEK293 cells after 30 mins by [86Rb+] flux functional assay
Bioorg Med Chem Lett 26: 2339-43 (2016)
BindingDB Entry DOI: 10.7270/Q2668G3Q