BDBM50163372 CHEMBL3793471
SMILES: O=C(Cc1ccc(cn1)-n1cnnn1)N1CCN(CCc2ccc3C(=O)OCc3c2)CC1
InChI Key: InChIKey=LFOZGFISIUFCQY-UHFFFAOYSA-N
Data: 2 IC50
Activity Spreadsheet -- Enzyme Inhibition Constant Data from BindingDB
Found 2 hits for monomerid = 50163372
Trg + Lig
Ki
nM
ΔG°
kcal/mole
IC50
nM
Kd
nM
EC50/IC50
nM
koff
s-1
kon
M-1s-1
pHTemp
°C
Renal Outer Medullary Potassium (ROMK)
(Rattus norvegicus (Rat))
BDBM50163372
(CHEMBL3793471)
Show SMILES O=C(Cc1ccc(cn1)-n1cnnn1)N1CCN(CCc2ccc3C(=O)OCc3c2)CC1
Show InChI InChI=1S/C22H23N7O3/c30-21(12-18-2-3-19(13-23-18)29-15-24-25-26-29)28-9-7-27(8-10-28)6-5-16-1-4-20-17(11-16)14-32-22(20)31/h1-4,11,13,15H,5-10,12,14H2
n/an/a 240n/an/an/an/an/an/a
Merck Research Laboratories
Curated by ChEMBL
Assay Description
Inhibition of rat ROMK expressed in HEK293 cells after 30 mins by [86Rb+] flux functional assay
Bioorg Med Chem Lett 26: 2339-43 (2016)
BindingDB Entry DOI: 10.7270/Q2668G3Q
1,3-beta-glucan synthase component GLS2
(Saccharomyces cerevisiae)
BDBM50163372
(CHEMBL3793471)
Show SMILES O=C(Cc1ccc(cn1)-n1cnnn1)N1CCN(CCc2ccc3C(=O)OCc3c2)CC1
Show InChI InChI=1S/C22H23N7O3/c30-21(12-18-2-3-19(13-23-18)29-15-24-25-26-29)28-9-7-27(8-10-28)6-5-16-1-4-20-17(11-16)14-32-22(20)31/h1-4,11,13,15H,5-10,12,14H2
n/an/a 4.60E+4n/an/an/an/an/an/a
Merck Research Laboratories
Curated by ChEMBL
Assay Description
Displacement of [35S]-MK499 from human ERG expressed in HEK293 cells
Bioorg Med Chem Lett 26: 2339-43 (2016)
BindingDB Entry DOI: 10.7270/Q2668G3Q