BDBM50163390 CHEMBL3793690
SMILES: O=C(NNc1c2ccccc2nc2ccccc12)c1ccccn1
InChI Key: InChIKey=DQDANBFGCYZFSZ-UHFFFAOYSA-N
Data: 1 IC50
Activity Spreadsheet -- Enzyme Inhibition Constant Data from BindingDB
Found 1 hit for monomerid = 50163390
Trg + Lig
Ki
nM
ΔG°
kcal/mole
IC50
nM
Kd
nM
EC50/IC50
nM
koff
s-1
kon
M-1s-1
pHTemp
°C
Lysine-specific demethylase 5A
(Homo sapiens (Human))
BDBM50163390
(CHEMBL3793690)
Show SMILES O=C(NNc1c2ccccc2nc2ccccc12)c1ccccn1
Show InChI InChI=1S/C19H14N4O/c24-19(17-11-5-6-12-20-17)23-22-18-13-7-1-3-9-15(13)21-16-10-4-2-8-14(16)18/h1-12H,(H,21,22)(H,23,24)
Reactome pathway
n/an/a 7.00E+3n/an/an/an/an/an/a
Sichuan University
Curated by ChEMBL
Assay Description
Inhibition of KDM5A (unknown origin) using substrate peptide/ascorbate/2-OG/ Fe(2) as substrate preincubated for 15 mins followed by addition of subs...
Bioorg Med Chem Lett 26: 2284-8 (2016)
BindingDB Entry DOI: 10.7270/Q2XP76TS