BDBM50163393 CHEMBL3793435
SMILES: Oc1ccccc1\C=N\Nc1ncc(F)c(n1)N1CCOCC1
InChI Key: InChIKey=HUWDYOJFOOSSNI-GIJQJNRQSA-N
Data: 1 IC50
Activity Spreadsheet -- Enzyme Inhibition Constant Data from BindingDB
Found 1 hit for monomerid = 50163393
Trg + Lig
Ki
nM
ΔG°
kcal/mole
IC50
nM
Kd
nM
EC50/IC50
nM
koff
s-1
kon
M-1s-1
pHTemp
°C
Lysine-specific demethylase 5A
(Homo sapiens (Human))
BDBM50163393
(CHEMBL3793435)
Show SMILES Oc1ccccc1\C=N\Nc1ncc(F)c(n1)N1CCOCC1
Show InChI InChI=1S/C15H16FN5O2/c16-12-10-17-15(19-14(12)21-5-7-23-8-6-21)20-18-9-11-3-1-2-4-13(11)22/h1-4,9-10,22H,5-8H2,(H,17,19,20)/b18-9+
Reactome pathway
n/an/a 2.30E+3n/an/an/an/an/an/a
Sichuan University
Curated by ChEMBL
Assay Description
Inhibition of KDM5A (unknown origin) using substrate peptide/ascorbate/2-OG/ Fe(2) as substrate preincubated for 15 mins followed by addition of subs...
Bioorg Med Chem Lett 26: 2284-8 (2016)
BindingDB Entry DOI: 10.7270/Q2XP76TS