BDBM50163411 CHEMBL3793443
SMILES: Clc1ccc(cc1)-n1[nH]c2c3C(=O)c4ccccc4C(=O)c3ccc2c1=O
InChI Key: InChIKey=SRNXZDOELWBLAV-UHFFFAOYSA-N
Data: 1 IC50
Activity Spreadsheet -- Enzyme Inhibition Constant Data from BindingDB
Found 1 hit for monomerid = 50163411
Trg + Lig
Ki
nM
ΔG°
kcal/mole
IC50
nM
Kd
nM
EC50/IC50
nM
koff
s-1
kon
M-1s-1
pHTemp
°C
Lysine-specific demethylase 5A
(Homo sapiens (Human))
BDBM50163411
(CHEMBL3793443)
Show SMILES Clc1ccc(cc1)-n1[nH]c2c3C(=O)c4ccccc4C(=O)c3ccc2c1=O
Show InChI InChI=1S/C21H11ClN2O3/c22-11-5-7-12(8-6-11)24-21(27)16-10-9-15-17(18(16)23-24)20(26)14-4-2-1-3-13(14)19(15)25/h1-10,23H
Reactome pathway
n/an/a 1.30E+4n/an/an/an/an/an/a
Sichuan University
Curated by ChEMBL
Assay Description
Inhibition of KDM5A (unknown origin) using substrate peptide/ascorbate/2-OG/ Fe(2) as substrate preincubated for 15 mins followed by addition of subs...
Bioorg Med Chem Lett 26: 2284-8 (2016)
BindingDB Entry DOI: 10.7270/Q2XP76TS