BDBM50163646 1-(4-Bromo-phenyl)-3-{(1R,2S)-2-[(S)-3-(4-fluoro-benzyl)-piperidin-1-ylmethyl]-cyclohexyl}-urea::CHEMBL193442
SMILES: Fc1ccc(C[C@@H]2CCCN(C[C@@H]3CCCC[C@H]3NC(=O)Nc3ccc(Br)cc3)C2)cc1
InChI Key: InChIKey=XOLRUKHPGCIPJW-STWLZBDKSA-N
Data: 2 IC50
Activity Spreadsheet -- Enzyme Inhibition Constant Data from BindingDB
Found 2 hits for monomerid = 50163646
Trg + Lig
Ki
nM
ΔG°
kcal/mole
IC50
nM
Kd
nM
EC50/IC50
nM
koff
s-1
kon
M-1s-1
pHTemp
°C
C-C chemokine receptor type 3
(Homo sapiens (Human))
BDBM50163646
(1-(4-Bromo-phenyl)-3-{(1R,2S)-2-[(S)-3-(4-fluoro-b...)
Show SMILES Fc1ccc(C[C@@H]2CCCN(C[C@@H]3CCCC[C@H]3NC(=O)Nc3ccc(Br)cc3)C2)cc1
Show InChI InChI=1S/C26H33BrFN3O/c27-22-9-13-24(14-10-22)29-26(32)30-25-6-2-1-5-21(25)18-31-15-3-4-20(17-31)16-19-7-11-23(28)12-8-19/h7-14,20-21,25H,1-6,15-18H2,(H2,29,30,32)/t20-,21-,25+/m0/s1
Reactome pathway
n/an/a 6n/an/an/an/an/an/a
Pharmaceutical Research Institute
Curated by ChEMBL
Assay Description
Inhibition of eotaxin-induced chemotaxis of human eosinophils
J Med Chem 48: 2194-211 (2005)
Article DOI: 10.1021/jm049530m
BindingDB Entry DOI: 10.7270/Q2XP74F1
C-C chemokine receptor type 3
(Homo sapiens (Human))
BDBM50163646
(1-(4-Bromo-phenyl)-3-{(1R,2S)-2-[(S)-3-(4-fluoro-b...)
Show SMILES Fc1ccc(C[C@@H]2CCCN(C[C@@H]3CCCC[C@H]3NC(=O)Nc3ccc(Br)cc3)C2)cc1
Show InChI InChI=1S/C26H33BrFN3O/c27-22-9-13-24(14-10-22)29-26(32)30-25-6-2-1-5-21(25)18-31-15-3-4-20(17-31)16-19-7-11-23(28)12-8-19/h7-14,20-21,25H,1-6,15-18H2,(H2,29,30,32)/t20-,21-,25+/m0/s1
Reactome pathway
n/an/a 50n/an/an/an/an/an/a
Pharmaceutical Research Institute
Curated by ChEMBL
Assay Description
Inhibition of calcium mobilization in human eosinophils
J Med Chem 48: 2194-211 (2005)
Article DOI: 10.1021/jm049530m
BindingDB Entry DOI: 10.7270/Q2XP74F1