BDBM50163671 1-{(1R,2S)-2-[(S)-3-(4-Fluoro-benzyl)-piperidin-1-ylmethyl]-cyclohexyl}-3-o-tolyl-urea::CHEMBL176077
SMILES: Cc1ccccc1NC(=O)N[C@@H]1CCCC[C@H]1CN1CCC[C@@H](Cc2ccc(F)cc2)C1
InChI Key: InChIKey=AUZDFHZZRBZEPU-JCYRPKCISA-N
Data: 2 IC50
Activity Spreadsheet -- Enzyme Inhibition Constant Data from BindingDB
Found 2 hits for monomerid = 50163671
Trg + Lig
Ki
nM
ΔG°
kcal/mole
IC50
nM
Kd
nM
EC50/IC50
nM
koff
s-1
kon
M-1s-1
pHTemp
°C
C-C chemokine receptor type 3
(Homo sapiens (Human))
BDBM50163671
(1-{(1R,2S)-2-[(S)-3-(4-Fluoro-benzyl)-piperidin-1-...)
Show SMILES Cc1ccccc1NC(=O)N[C@@H]1CCCC[C@H]1CN1CCC[C@@H](Cc2ccc(F)cc2)C1
Show InChI InChI=1S/C27H36FN3O/c1-20-7-2-4-10-25(20)29-27(32)30-26-11-5-3-9-23(26)19-31-16-6-8-22(18-31)17-21-12-14-24(28)15-13-21/h2,4,7,10,12-15,22-23,26H,3,5-6,8-9,11,16-19H2,1H3,(H2,29,30,32)/t22-,23-,26+/m0/s1
Reactome pathway
n/an/a 1.60n/an/an/an/an/an/a
Pharmaceutical Research Institute
Curated by ChEMBL
Assay Description
Inhibition of eotaxin-induced chemotaxis of human eosinophils
J Med Chem 48: 2194-211 (2005)
Article DOI: 10.1021/jm049530m
BindingDB Entry DOI: 10.7270/Q2XP74F1
C-C chemokine receptor type 3
(Homo sapiens (Human))
BDBM50163671
(1-{(1R,2S)-2-[(S)-3-(4-Fluoro-benzyl)-piperidin-1-...)
Show SMILES Cc1ccccc1NC(=O)N[C@@H]1CCCC[C@H]1CN1CCC[C@@H](Cc2ccc(F)cc2)C1
Show InChI InChI=1S/C27H36FN3O/c1-20-7-2-4-10-25(20)29-27(32)30-26-11-5-3-9-23(26)19-31-16-6-8-22(18-31)17-21-12-14-24(28)15-13-21/h2,4,7,10,12-15,22-23,26H,3,5-6,8-9,11,16-19H2,1H3,(H2,29,30,32)/t22-,23-,26+/m0/s1
Reactome pathway
n/an/a>100n/an/an/an/an/an/a
Pharmaceutical Research Institute
Curated by ChEMBL
Assay Description
Inhibition of eotaxin-induced chemotaxis of human eosinophils
J Med Chem 48: 2194-211 (2005)
Article DOI: 10.1021/jm049530m
BindingDB Entry DOI: 10.7270/Q2XP74F1