BDBM50163675 1-{(1R,2S)-2-[(S)-3-(4-Fluoro-benzyl)-piperidin-1-ylmethyl]-cyclohexyl}-3-(2-fluoro-phenyl)-urea::CHEMBL193330
SMILES: Fc1ccc(C[C@@H]2CCCN(C[C@@H]3CCCC[C@H]3NC(=O)Nc3ccccc3F)C2)cc1
InChI Key: InChIKey=MXFQLVWOVUVANY-AWRGLXIESA-N
Data: 1 IC50
Activity Spreadsheet -- Enzyme Inhibition Constant Data from BindingDB
Found 1 hit for monomerid = 50163675
Trg + Lig
Ki
nM
ΔG°
kcal/mole
IC50
nM
Kd
nM
EC50/IC50
nM
koff
s-1
kon
M-1s-1
pHTemp
°C
C-C chemokine receptor type 3
(Homo sapiens (Human))
BDBM50163675
(1-{(1R,2S)-2-[(S)-3-(4-Fluoro-benzyl)-piperidin-1-...)
Show SMILES Fc1ccc(C[C@@H]2CCCN(C[C@@H]3CCCC[C@H]3NC(=O)Nc3ccccc3F)C2)cc1
Show InChI InChI=1S/C26H33F2N3O/c27-22-13-11-19(12-14-22)16-20-6-5-15-31(17-20)18-21-7-1-3-9-24(21)29-26(32)30-25-10-4-2-8-23(25)28/h2,4,8,10-14,20-21,24H,1,3,5-7,9,15-18H2,(H2,29,30,32)/t20-,21-,24+/m0/s1
Reactome pathway
n/an/a 1.80n/an/an/an/an/an/a
Pharmaceutical Research Institute
Curated by ChEMBL
Assay Description
Inhibition of eotaxin-induced chemotaxis of human eosinophils
J Med Chem 48: 2194-211 (2005)
Article DOI: 10.1021/jm049530m
BindingDB Entry DOI: 10.7270/Q2XP74F1