BDBM50163676 1-{(1R,2S)-2-[(S)-3-(4-Fluoro-benzyl)-piperidin-1-ylmethyl]-cyclohexyl}-3-thiazol-2-yl-urea::CHEMBL195129
SMILES: Fc1ccc(C[C@@H]2CCCN(C[C@@H]3CCCC[C@H]3NC(=O)Nc3nccs3)C2)cc1
InChI Key: InChIKey=ZKBWZHHPBACPCQ-IRFCIJBXSA-N
Data: 1 IC50
Activity Spreadsheet -- Enzyme Inhibition Constant Data from BindingDB
Found 1 hit for monomerid = 50163676
Trg + Lig
Ki
nM
ΔG°
kcal/mole
IC50
nM
Kd
nM
EC50/IC50
nM
koff
s-1
kon
M-1s-1
pHTemp
°C
C-C chemokine receptor type 3
(Homo sapiens (Human))
BDBM50163676
(1-{(1R,2S)-2-[(S)-3-(4-Fluoro-benzyl)-piperidin-1-...)
Show SMILES Fc1ccc(C[C@@H]2CCCN(C[C@@H]3CCCC[C@H]3NC(=O)Nc3nccs3)C2)cc1
Show InChI InChI=1S/C23H31FN4OS/c24-20-9-7-17(8-10-20)14-18-4-3-12-28(15-18)16-19-5-1-2-6-21(19)26-22(29)27-23-25-11-13-30-23/h7-11,13,18-19,21H,1-6,12,14-16H2,(H2,25,26,27,29)/t18-,19-,21+/m0/s1
Reactome pathway
n/an/a 1.90n/an/an/an/an/an/a
Pharmaceutical Research Institute
Curated by ChEMBL
Assay Description
Inhibition of eotaxin-induced chemotaxis of human eosinophils
J Med Chem 48: 2194-211 (2005)
Article DOI: 10.1021/jm049530m
BindingDB Entry DOI: 10.7270/Q2XP74F1