BDBM50163684 1-(3,4-Difluoro-phenyl)-3-{(1R,2S)-2-[(S)-3-(4-fluoro-benzyl)-piperidin-1-ylmethyl]-cyclohexyl}-urea::CHEMBL194384
SMILES: Fc1ccc(C[C@@H]2CCCN(C[C@@H]3CCCC[C@H]3NC(=O)Nc3ccc(F)c(F)c3)C2)cc1
InChI Key: InChIKey=RKLGZRTYSTXJRW-ZYLNGJIFSA-N
Data: 1 IC50
Activity Spreadsheet -- Enzyme Inhibition Constant Data from BindingDB
Found 1 hit for monomerid = 50163684
Trg + Lig
Ki
nM
ΔG°
kcal/mole
IC50
nM
Kd
nM
EC50/IC50
nM
koff
s-1
kon
M-1s-1
pHTemp
°C
C-C chemokine receptor type 3
(Homo sapiens (Human))
BDBM50163684
(1-(3,4-Difluoro-phenyl)-3-{(1R,2S)-2-[(S)-3-(4-flu...)
Show SMILES Fc1ccc(C[C@@H]2CCCN(C[C@@H]3CCCC[C@H]3NC(=O)Nc3ccc(F)c(F)c3)C2)cc1
Show InChI InChI=1S/C26H32F3N3O/c27-21-9-7-18(8-10-21)14-19-4-3-13-32(16-19)17-20-5-1-2-6-25(20)31-26(33)30-22-11-12-23(28)24(29)15-22/h7-12,15,19-20,25H,1-6,13-14,16-17H2,(H2,30,31,33)/t19-,20-,25+/m0/s1
Reactome pathway
n/an/a 12n/an/an/an/an/an/a
Pharmaceutical Research Institute
Curated by ChEMBL
Assay Description
Inhibition of eotaxin-induced chemotaxis of human eosinophils
J Med Chem 48: 2194-211 (2005)
Article DOI: 10.1021/jm049530m
BindingDB Entry DOI: 10.7270/Q2XP74F1