BDBM50163799 5-Amino-3-(2-ethoxy-ethyl)-3-[4-(4-[1,3,4]oxadiazol-2-yl-phenoxy)-phenoxy]-piperidine-2,4,6-trione::CHEMBL183410
SMILES: CCOCCC1(Oc2ccc(Oc3ccc(cc3)-c3nnco3)cc2)C(=O)NC(=O)C(N)C1=O
InChI Key: InChIKey=ZTJUBPXNBSLSGL-UHFFFAOYSA-N
Data: 8 IC50
Activity Spreadsheet -- Enzyme Inhibition Constant Data from BindingDB
Found 8 hits for monomerid = 50163799
Trg + Lig
Ki
nM
ΔG°
kcal/mole
IC50
nM
Kd
nM
EC50/IC50
nM
koff
s-1
kon
M-1s-1
pHTemp
°C
Matrix metalloproteinase-14 (MMP14)
(Homo sapiens (Human))
BDBM50163799
(5-Amino-3-(2-ethoxy-ethyl)-3-[4-(4-[1,3,4]oxadiazo...)
Show SMILES CCOCCC1(Oc2ccc(Oc3ccc(cc3)-c3nnco3)cc2)C(=O)NC(=O)C(N)C1=O
Show InChI InChI=1S/C23H22N4O7/c1-2-31-12-11-23(19(28)18(24)20(29)26-22(23)30)34-17-9-7-16(8-10-17)33-15-5-3-14(4-6-15)21-27-25-13-32-21/h3-10,13,18H,2,11-12,24H2,1H3,(H,26,29,30)
n/an/a 220n/an/an/an/an/an/a
Pfizer Global Research and Development
Curated by ChEMBL
Assay Description
Inhibitory concentration against matrix metalloprotease 14
Bioorg Med Chem Lett 15: 1807-10 (2005)
Article DOI: 10.1016/j.bmcl.2005.02.038
BindingDB Entry DOI: 10.7270/Q2JH3KPW
72 kDa type IV collagenase
(Homo sapiens (Human))
BDBM50163799
(5-Amino-3-(2-ethoxy-ethyl)-3-[4-(4-[1,3,4]oxadiazo...)
Show SMILES CCOCCC1(Oc2ccc(Oc3ccc(cc3)-c3nnco3)cc2)C(=O)NC(=O)C(N)C1=O
Show InChI InChI=1S/C23H22N4O7/c1-2-31-12-11-23(19(28)18(24)20(29)26-22(23)30)34-17-9-7-16(8-10-17)33-15-5-3-14(4-6-15)21-27-25-13-32-21/h3-10,13,18H,2,11-12,24H2,1H3,(H,26,29,30)
Reactome pathway
n/an/a 21n/an/an/an/an/an/a
Pfizer Global Research and Development
Curated by ChEMBL
Assay Description
Inhibitory concentration against matrix metalloprotease 2
Bioorg Med Chem Lett 15: 1807-10 (2005)
Article DOI: 10.1016/j.bmcl.2005.02.038
BindingDB Entry DOI: 10.7270/Q2JH3KPW
Neutrophil collagenase
(Homo sapiens (Human))
BDBM50163799
(5-Amino-3-(2-ethoxy-ethyl)-3-[4-(4-[1,3,4]oxadiazo...)
Show SMILES CCOCCC1(Oc2ccc(Oc3ccc(cc3)-c3nnco3)cc2)C(=O)NC(=O)C(N)C1=O
Show InChI InChI=1S/C23H22N4O7/c1-2-31-12-11-23(19(28)18(24)20(29)26-22(23)30)34-17-9-7-16(8-10-17)33-15-5-3-14(4-6-15)21-27-25-13-32-21/h3-10,13,18H,2,11-12,24H2,1H3,(H,26,29,30)
Reactome pathway
n/an/a 31n/an/an/an/an/an/a
Pfizer Global Research and Development
Curated by ChEMBL
Assay Description
Inhibitory concentration against matrix metalloprotease 8
Bioorg Med Chem Lett 15: 1807-10 (2005)
Article DOI: 10.1016/j.bmcl.2005.02.038
BindingDB Entry DOI: 10.7270/Q2JH3KPW
72 kDa type IV collagenase
(Homo sapiens (Human))
BDBM50163799
(5-Amino-3-(2-ethoxy-ethyl)-3-[4-(4-[1,3,4]oxadiazo...)
Show SMILES CCOCCC1(Oc2ccc(Oc3ccc(cc3)-c3nnco3)cc2)C(=O)NC(=O)C(N)C1=O
Show InChI InChI=1S/C23H22N4O7/c1-2-31-12-11-23(19(28)18(24)20(29)26-22(23)30)34-17-9-7-16(8-10-17)33-15-5-3-14(4-6-15)21-27-25-13-32-21/h3-10,13,18H,2,11-12,24H2,1H3,(H,26,29,30)
Reactome pathway
n/an/a 21n/an/an/an/an/an/a
Jadavpur University
Curated by ChEMBL
Assay Description
Inhibition of human recombinant MMP2 using (Ac-PLG-[2-mercapto-4-85 methylpentanoyl]-LG-OC2H5) as substrate by microplate photometric analysis
Bioorg Med Chem 24: 4291-4309 (2016)
BindingDB Entry DOI: 10.7270/Q2S46TW0
Interstitial collagenase
(Homo sapiens (Human))
BDBM50163799
(5-Amino-3-(2-ethoxy-ethyl)-3-[4-(4-[1,3,4]oxadiazo...)
Show SMILES CCOCCC1(Oc2ccc(Oc3ccc(cc3)-c3nnco3)cc2)C(=O)NC(=O)C(N)C1=O
Show InChI InChI=1S/C23H22N4O7/c1-2-31-12-11-23(19(28)18(24)20(29)26-22(23)30)34-17-9-7-16(8-10-17)33-15-5-3-14(4-6-15)21-27-25-13-32-21/h3-10,13,18H,2,11-12,24H2,1H3,(H,26,29,30)
Reactome pathway
n/an/a 1.30E+4n/an/an/an/an/an/a
Pfizer Global Research and Development
Curated by ChEMBL
Assay Description
Inhibitory concentration against matrix metalloprotease 1
Bioorg Med Chem Lett 15: 1807-10 (2005)
Article DOI: 10.1016/j.bmcl.2005.02.038
BindingDB Entry DOI: 10.7270/Q2JH3KPW
Matrix metalloproteinase-12 (MMP12)
(Homo sapiens (Human))
BDBM50163799
(5-Amino-3-(2-ethoxy-ethyl)-3-[4-(4-[1,3,4]oxadiazo...)
Show SMILES CCOCCC1(Oc2ccc(Oc3ccc(cc3)-c3nnco3)cc2)C(=O)NC(=O)C(N)C1=O
Show InChI InChI=1S/C23H22N4O7/c1-2-31-12-11-23(19(28)18(24)20(29)26-22(23)30)34-17-9-7-16(8-10-17)33-15-5-3-14(4-6-15)21-27-25-13-32-21/h3-10,13,18H,2,11-12,24H2,1H3,(H,26,29,30)
Reactome pathway
n/an/a 29n/an/an/an/an/an/a
Pfizer Global Research and Development
Curated by ChEMBL
Assay Description
Inhibitory concentration against matrix metalloprotease 12
Bioorg Med Chem Lett 15: 1807-10 (2005)
Article DOI: 10.1016/j.bmcl.2005.02.038
BindingDB Entry DOI: 10.7270/Q2JH3KPW
72 kDa type IV collagenase
(Homo sapiens (Human))
BDBM50163799
(5-Amino-3-(2-ethoxy-ethyl)-3-[4-(4-[1,3,4]oxadiazo...)
Show SMILES CCOCCC1(Oc2ccc(Oc3ccc(cc3)-c3nnco3)cc2)C(=O)NC(=O)C(N)C1=O
Show InChI InChI=1S/C23H22N4O7/c1-2-31-12-11-23(19(28)18(24)20(29)26-22(23)30)34-17-9-7-16(8-10-17)33-15-5-3-14(4-6-15)21-27-25-13-32-21/h3-10,13,18H,2,11-12,24H2,1H3,(H,26,29,30)
Reactome pathway
n/an/a 21n/an/an/an/an/an/a
Jadavpur University
Curated by ChEMBL
Assay Description
Inhibition of human recombinant MMP2 using (Ac-PLG-[2-mercapto-4-85 methylpentanoyl]-LG-OC2H5) as substrate by microplate photometric analysis
Bioorg Med Chem 24: 4291-4309 (2016)
BindingDB Entry DOI: 10.7270/Q2S46TW0
Collagenase 3
(Homo sapiens (Human))
BDBM50163799
(5-Amino-3-(2-ethoxy-ethyl)-3-[4-(4-[1,3,4]oxadiazo...)
Show SMILES CCOCCC1(Oc2ccc(Oc3ccc(cc3)-c3nnco3)cc2)C(=O)NC(=O)C(N)C1=O
Show InChI InChI=1S/C23H22N4O7/c1-2-31-12-11-23(19(28)18(24)20(29)26-22(23)30)34-17-9-7-16(8-10-17)33-15-5-3-14(4-6-15)21-27-25-13-32-21/h3-10,13,18H,2,11-12,24H2,1H3,(H,26,29,30)
NCI pathway
Reactome pathway
n/an/a 1n/an/an/an/an/an/a
Pfizer Global Research and Development
Curated by ChEMBL
Assay Description
Inhibitory concentration against matrix metalloprotease 13
Bioorg Med Chem Lett 15: 1807-10 (2005)
Article DOI: 10.1016/j.bmcl.2005.02.038
BindingDB Entry DOI: 10.7270/Q2JH3KPW