BDBM50163824 5-Amino-3-(2-ethoxy-ethyl)-3-[4-(4-imidazol-1-yl-phenoxy)-phenoxy]-piperidine-2,4,6-trione::CHEMBL183713
SMILES: CCOCCC1(Oc2ccc(Oc3ccc(cc3)-n3ccnc3)cc2)C(=O)NC(=O)C(N)C1=O
InChI Key: InChIKey=FRIYTZJGYCAFHL-UHFFFAOYSA-N
Data: 2 IC50
Activity Spreadsheet -- Enzyme Inhibition Constant Data from BindingDB
Found 2 hits for monomerid = 50163824
Trg + Lig
Ki
nM
ΔG°
kcal/mole
IC50
nM
Kd
nM
EC50/IC50
nM
koff
s-1
kon
M-1s-1
pHTemp
°C
Collagenase 3
(Homo sapiens (Human))
BDBM50163824
(5-Amino-3-(2-ethoxy-ethyl)-3-[4-(4-imidazol-1-yl-p...)
Show SMILES CCOCCC1(Oc2ccc(Oc3ccc(cc3)-n3ccnc3)cc2)C(=O)NC(=O)C(N)C1=O
Show InChI InChI=1S/C24H24N4O6/c1-2-32-14-11-24(21(29)20(25)22(30)27-23(24)31)34-19-9-7-18(8-10-19)33-17-5-3-16(4-6-17)28-13-12-26-15-28/h3-10,12-13,15,20H,2,11,14,25H2,1H3,(H,27,30,31)
NCI pathway
Reactome pathway
n/an/a 0.950n/an/an/an/an/an/a
Pfizer Global Research and Development
Curated by ChEMBL
Assay Description
Inhibitory concentration against matrix metalloprotease 13
Bioorg Med Chem Lett 15: 1807-10 (2005)
Article DOI: 10.1016/j.bmcl.2005.02.038
BindingDB Entry DOI: 10.7270/Q2JH3KPW
Matrix metalloproteinase-14 (MMP14)
(Homo sapiens (Human))
BDBM50163824
(5-Amino-3-(2-ethoxy-ethyl)-3-[4-(4-imidazol-1-yl-p...)
Show SMILES CCOCCC1(Oc2ccc(Oc3ccc(cc3)-n3ccnc3)cc2)C(=O)NC(=O)C(N)C1=O
Show InChI InChI=1S/C24H24N4O6/c1-2-32-14-11-24(21(29)20(25)22(30)27-23(24)31)34-19-9-7-18(8-10-19)33-17-5-3-16(4-6-17)28-13-12-26-15-28/h3-10,12-13,15,20H,2,11,14,25H2,1H3,(H,27,30,31)
n/an/a 18n/an/an/an/an/an/a
Pfizer Global Research and Development
Curated by ChEMBL
Assay Description
Inhibitory concentration against matrix metalloprotease 14
Bioorg Med Chem Lett 15: 1807-10 (2005)
Article DOI: 10.1016/j.bmcl.2005.02.038
BindingDB Entry DOI: 10.7270/Q2JH3KPW