BDBM50163855 CHEMBL3799212
SMILES: CN1c2ccc(cc2CS1(=O)=O)-c1cnc(N)c(Cl)c1N1CCC2(CCNC2=O)CC1
InChI Key: InChIKey=GQWMRZZYHJLZFL-UHFFFAOYSA-N
Data: 1 IC50
Activity Spreadsheet -- Enzyme Inhibition Constant Data from BindingDB
Found 1 hit for monomerid = 50163855
Trg + Lig
Ki
nM
ΔG°
kcal/mole
IC50
nM
Kd
nM
EC50/IC50
nM
koff
s-1
kon
M-1s-1
pHTemp
°C
Cyclin-dependent kinase 8
(Homo sapiens (Human))
BDBM50163855
(CHEMBL3799212)
Show SMILES CN1c2ccc(cc2CS1(=O)=O)-c1cnc(N)c(Cl)c1N1CCC2(CCNC2=O)CC1
Show InChI InChI=1S/C21H24ClN5O3S/c1-26-16-3-2-13(10-14(16)12-31(26,29)30)15-11-25-19(23)17(22)18(15)27-8-5-21(6-9-27)4-7-24-20(21)28/h2-3,10-11H,4-9,12H2,1H3,(H2,23,25)(H,24,28)
Reactome pathway
n/an/a 2.30n/an/an/an/an/an/a
The Institute of Cancer Research
Curated by ChEMBL
Assay Description
Binding affinity to His-tagged CDK8 (unknown origin) after 60 mins by FRET based lanthascreen binding assay
J Med Chem 59: 1078-101 (2016)
BindingDB Entry DOI: 10.7270/Q29025P6