BDBM50163997 4-(4-Methoxy-benzenesulfonyl)-4-phenyl-piperidine-1-carboxylic acid ethyl ester::CHEMBL360740
SMILES: CCOC(=O)N1CCC(CC1)(c1ccccc1)S(=O)(=O)c1ccc(OC)cc1
InChI Key: InChIKey=QQFIKDACOYRIAM-UHFFFAOYSA-N
Data: 1 EC50
Activity Spreadsheet -- Enzyme Inhibition Constant Data from BindingDB
Found 1 hit for monomerid = 50163997
Trg + Lig
Ki
nM
ΔG°
kcal/mole
IC50
nM
Kd
nM
EC50/IC50
nM
koff
s-1
kon
M-1s-1
pHTemp
°C
Beta amyloid A4 protein
(Homo sapiens (Human))
BDBM50163997
(4-(4-Methoxy-benzenesulfonyl)-4-phenyl-piperidine-...)
Show SMILES CCOC(=O)N1CCC(CC1)(c1ccccc1)S(=O)(=O)c1ccc(OC)cc1
Show InChI InChI=1S/C21H25NO5S/c1-3-27-20(23)22-15-13-21(14-16-22,17-7-5-4-6-8-17)28(24,25)19-11-9-18(26-2)10-12-19/h4-12H,3,13-16H2,1-2H3
Reactome pathway
n/an/an/an/a 9.70E+4n/an/an/an/a
Wyeth Research
Curated by ChEMBL
Assay Description
In vitro effective concentration against beta amyloid protein 40 in ELISA
Bioorg Med Chem Lett 15: 1891-4 (2005)
Article DOI: 10.1016/j.bmcl.2005.02.006
BindingDB Entry DOI: 10.7270/Q2N879B4